Peptide,PTM,ModifiedAA,ModifiedPosition,PeptideUniqueToGene,ExperimentDesc,ExpID,PubmedID,ScoreType,IdentScore,LocProb,Log2FChange,PQ-val,QuantSig,PEP,MassErrorPPM
SSHPILLAVADEAKGSGPIVTSR,ph,S,152,true,"Tissue atlas Arabidopsis - ProteomicsDB",114,32188942,"MaxQuant score",129.0300000,0.9941380,,,,5.3513502843596E-23,
HDGPGPSLSSSPGRK,ph,S,338,true,"atm and atr DNA damage response",88,25561503,"MASCOT Score",59.0000000,1.0000000,,,,,0.1100000
HDGPGPSLSSSPGR,ph,S,338,true,"Lateral root-induction - NAA vs control",106,23328941,"MASCOT Score",30.0000000,,-0.2797312,0.1667138,NO,,
HDGPGPSLSSSPGR,ph,S,340,true,"Lateral root-induction - NAA vs control",106,23328941,"MASCOT Score",30.0000000,,,,,,
HDGPGPSLSSSPGR,ph,S,341,true,"Tissue atlas Arabidopsis - ProteomicsDB",114,32188942,"MaxQuant score",193.1900000,0.8251300,,,,1.6872900150404E-31,
HDGPGPSLSSSPGRK,ph,S,342,true,"SnRK2 protein kinase substrates",85,23776212,XCorr,2.8663046,0.7650000,,,,7.3837298259605E-5,
HDGPGPSLSSSPGRK,ph,S,342,true,"Phospho cell culture sucrose/TOR",109,30833711,,,0.7556620,,,,,
HDGPGPSLSSSPGR,ph,S,342,true,"Tissue atlas Arabidopsis - ProteomicsDB",114,32188942,"MaxQuant score",261.5000000,0.9991240,,,,0,
VGSHSAESDVVGTVIVK,ph,S,352,true,"Tissue atlas Arabidopsis - ProteomicsDB",114,32188942,"MaxQuant score",270.6100000,0.9996900,,,,0,
VGSHSAESDVVGTVIVK,ph,S,357,true,"TOR Kinase and ABA Receptor",100,29290610,XCorr,3.1770141,0.7878000,,,,0.0018390000332147,
NGATSGLTSEEELR,ph,S,606,true,"Tissue atlas Arabidopsis - ProteomicsDB",114,32188942,"MaxQuant score",95.5700000,0.9881630,,,,0.00015883099695202,
KNAELTVDTSDSEDQTKPLEK,ph,T,656,true,"Tissue atlas Arabidopsis - ProteomicsDB",114,32188942,"MaxQuant score",127.1700000,0.8162920,,,,1.7422799363086E-16,
NAELTVDTSDSEDQTKPLEK,ph,T,656,true,"Lateral root-induction - NAA vs control",106,23328941,"MASCOT Score",66.0000000,,,,,,
NAELTVDTSDSEDQTKPLEK,ph,S,657,true,"Lateral root-induction - NAA vs control",106,23328941,"MASCOT Score",36.0000000,,,,,,
NAELTVDTSDSEDQTKPLEK,ph,S,657,true,"Col-0 callus - FC Col-0 vs. Col-0 Xray",111a,31410901,,20.6500000,,-0.1184714,0.0000000,NO,,2.0058514
NAELTVDTSDSEDQTKPLEK,ph,S,657,true,"Col-0 X-ray callus - FC Col-0 vs. Col-0 Xray",111b,31410901,,20.6500000,,-0.1184714,0.0000000,NO,,2.0058514
NAELTVDTSDSEDQTKPLEK,ph,S,657,true,"atm callus - FC atm vs. atm Xray",111c,31410901,,20.6500000,,0.3663108,0.0000000,NO,,2.0058514
NAELTVDTSDSEDQTKPLEK,ph,S,657,true,"atm-3 X-ray callus - FC atm vs. atm Xray",111d,31410901,,20.6500000,,0.3663108,0.0000000,NO,,2.0058514
NAELTVDTSDSEDQTKPLEK,ph,S,657,true,"Tissue atlas Arabidopsis - ProteomicsDB",114,32188942,"MaxQuant score",266.2800000,0.9919580,,,,0,
NAELTVDTSDSEDQTKPLEK,ph,S,659,true,"Conserved plant phosphoproteome - Arabidopsis",61a,20466843,"MASCOT Score",33.0000000,1.0000000,,,,,
GFSGERDSDSSSSSDPGQVK,ph,S,759,true,"Tissue atlas Arabidopsis - ProteomicsDB",114,32188942,"MaxQuant score",57.0340000,0.8598500,,,,0.0018747700378299,
RGSAHFALTPNQNPHTGIVTFK,ph,S,790,true,"Tissue atlas Arabidopsis - ProteomicsDB",114,32188942,"MaxQuant score",120.6400000,1.0000000,,,,2.4465100520929E-21,
GSAHFALTPNQNPHTGIVTFK,ph,T,796,true,"Tissue atlas Arabidopsis - ProteomicsDB",114,32188942,"MaxQuant score",187.1300000,1.0000000,,,,4.2038953929745E-45,
NASLPAETK,ph,S,837,true,"TOR Kinase and ABA Receptor",100,29290610,XCorr,2.6938493,0.9995000,,,,0.0028319999109954,
NASLPAETK,ph,S,837,true,"Lateral root-induction - NAA vs control",106,23328941,"MASCOT Score",24.0000000,,,,,,
NASLPAETK,ph,S,837,true,"Tissue atlas Arabidopsis - ProteomicsDB",114,32188942,"MaxQuant score",129.8200000,1.0000000,,,,0.00012973400589544,
IENSSGISGDSNVSSNR,ph,S,851,true,"Tissue atlas Arabidopsis - ProteomicsDB",114,32188942,"MaxQuant score",98.5730000,0.9707590,,,,1.8505000198843E-8,
