Peptide,PTM,ModifiedAA,ModifiedPosition,PeptideUniqueToGene,ExperimentDesc,ExpID,PubmedID,ScoreType,IdentScore,LocProb,Log2FChange,PQ-val,QuantSig,PEP,MassErrorPPM
SSLSFNLR,ph,S,38,true,"Tissue atlas Arabidopsis - ProteomicsDB",114,32188942,"MaxQuant score",107.2100000,0.9999780,,,,0.0039491001516581,
AAKPETVDKVCAVVRKQL,nt,A,53,false,"Arabidopsis translation initiation landscape - NT",167b,35069635,,,,,,,,
AAKPETVDKVCAVVR,nt,A,53,false,"Arg/N-end rule pathway Roots",80,25728785,"MASCOT Score",79.3700000,,,,,2.4639998930098E-9,
AAKPETVDKVCAVVR,nt,A,53,false,"Stromal N-terminome",96,26371235,"MASCOT Score",81.2500000,,,,,,
AAKPETVDKVCAVVR,nt,A,53,false,"FtsH12 N-terminome: WT / FtsH12 knockdown miRNA",118,33216923,"MaxQuant score",79.4660000,,0.4052313,0.0682731,NO,0.00076719000935555,
AKPETVDKVCAVVRKQL,nt,A,54,false,"Arabidopsis translation initiation landscape - NT",167b,35069635,,,,,,,,
AKPETVDKVCAVVR,nt,A,54,false,"Arg/N-end rule pathway Roots",80,25728785,"MASCOT Score",90.0300000,,,,,7.2349998214705E-10,
AKPETVDKVCAVVR,nt,A,54,false,"Stromal N-terminome",96,26371235,"MASCOT Score",43.1700000,,,,,,
VCAVVR,ox,C,63,false,"OxiTRAQ Arabidopsis - 5 mM H2O2 versus control",47,24376095,,,,-0.0319715,0.8231706,NO,,
VCAVVR,sno,C,63,false,"hot5-4 / wildtype, FAT-switch S-nitrosoproteome",169,37277371,,,,0.2372493,0.1589626,NO,,
VCAVVRK,so,C,63,false,"S-sulfenylation site detection using YAP1C",110,32714340,,,,,,,,
VCAVVR,so,C,63,false,"Arabidopsis S-sulfenylation chemoproteomics",108,31578252,"pFind PSM Score",0.0186235,,2.6614300,,,,0.2914466
KQLSLKEADEITAATK,ph,S,71,false,"Phospho cell culture sucrose/TOR",109,30833711,,,0.9999310,,,,,
QLSLKEADEITAATK,ph,T,79,false,"Sucrose-induced phosphorylation",24,17586839,,,,,,,,
