Peptide,PTM,ModifiedAA,ModifiedPosition,PeptideUniqueToGene,ExperimentDesc,ExpID,PubmedID,ScoreType,IdentScore,LocProb,Log2FChange,PQ-val,QuantSig,PEP,MassErrorPPM
AVSRDDAATPLSSSDQTQETETKEVED,nt,A,55,true,"HUNTER N-terminome: legumain, GluC and trypsin",119,31951383,"MaxQuant score",175.1100000,,,,,,
AVSRDDAATPLSSSDQTQETE,nt,A,55,true,"HUNTER N-terminome: legumain, GluC and trypsin",119,31951383,"MaxQuant score",106.0300000,,,,,,
AVSRDDAATPLSSSDQTQE,nt,A,55,true,"Arg/N-end rule seed, prt6 vs. Wt",99,29168982,"MASCOT Score",28.6300000,,0.3456621,0.1007097,NO,8.1640000644256E-6,-0.6397290
AVSRDDAATPLSSSDQTQE,nt,A,55,true,"HUNTER N-terminome: legumain, GluC and trypsin",119,31951383,"MaxQuant score",289.2200000,,,,,,
AVSRDDAATPLSSSDQTQETETKEVED,nta,A,55,true,"HUNTER N-terminome: legumain, GluC and trypsin",119,31951383,"MaxQuant score",94.1920000,,,,,,
AVSRDDAATPLSSSDQTQETE,nta,A,55,true,"HUNTER N-terminome: legumain, GluC and trypsin",119,31951383,"MaxQuant score",96.6730000,,,,,,
AVSRDDAATPLSSSDQTQE,nta,A,55,true,"HUNTER N-terminome: legumain, GluC and trypsin",119,31951383,"MaxQuant score",292.7600000,,,,,,
VSRDDAATPLSSSDQTQETETKEVEDTIEKR,nt,V,56,true,"HUNTER N-terminome: legumain, GluC and trypsin",119,31951383,"MaxQuant score",43.2560000,,,,,,
VSRDDAATPLSSSDQTQETETKEVED,nt,V,56,true,"HUNTER N-terminome: legumain, GluC and trypsin",119,31951383,"MaxQuant score",153.8400000,,,,,,
VSRDDAATPLSSSDQTQE,nt,V,56,true,"HUNTER N-terminome: legumain, GluC and trypsin",119,31951383,"MaxQuant score",247.9000000,,,,,,
VSRDDAATPLSSSDQTQE,nta,V,56,true,"HUNTER N-terminome: legumain, GluC and trypsin",119,31951383,"MaxQuant score",206.6300000,,,,,,
DDAATPLSSSDQTQETETK,ph,S,66,true,"Tissue atlas Arabidopsis - ProteomicsDB",114,32188942,"MaxQuant score",110.7400000,0.7998930,,,,3.9577999211282E-10,
EVEDTIEKR,ac,K,85,true,"Histone deacetylases substrates - hda14 vs WT",98e,29061669,"MaxQuant Score",82.3000000,1.0000000,0.1170000,0.9484185,NO,0.0040000001899898,
EVEDTIEKR,ac,K,85,true,"Quantitative Acetylproteomics",101,29440448,,,,,,,,
CPTCGAAQSFFESK,ox,C,135,true,"SPEAR - 50 mM H2O2 / mock",138b,34619326,,,,-2.7586602,0.0021622,YES,,
