Peptide,PTM,ModifiedAA,ModifiedPosition,PeptideUniqueToGene,ExperimentDesc,ExpID,PubmedID,ScoreType,IdentScore,LocProb,Log2FChange,PQ-val,QuantSig,PEP,MassErrorPPM
AGLINKIGDALH,nt,A,2,true,"Stromal N-terminome",96,26371235,"MASCOT Score",39.5000000,,,,,,
AGLINKIGDALH,nt,A,2,true,"Arg/N-end rule seed, prt6 vs. Wt",99,29168982,"MASCOT Score",69.3200000,,,,,0.0015739999944344,1.6484870
AGLINKIGDAL,nt,A,2,true,"Arg/N-end rule seed, prt6 vs. Wt",99,29168982,"MASCOT Score",25.5800000,,,,,0.081880003213882,-2.0932230
AGLINKIGDALHIGGGNK,nta,A,2,true,"Arg/N-end rule pathway Roots",80,25728785,"MASCOT Score",53.1400000,,,,,5.2479999794741E-6,
AGLINKIGDALH,nta,A,2,true,"Stromal N-terminome",96,26371235,"MASCOT Score",39.5000000,,,,,,
AGLINKIGDALH,nta,A,2,true,"Arg/N-end rule seed, prt6 vs. Wt",99,29168982,"MASCOT Score",69.3200000,,-0.4029873,0.0909249,NO,0.0015739999944344,1.6484870
AGLINKIGDAL,nta,A,2,true,"Arg/N-end rule pathway Roots",80,25728785,"MASCOT Score",51.4100000,,,,,0.012360000051558,
AGLINKIGDAL,nta,A,2,true,"Arg/N-end rule seed, prt6 vs. Wt",99,29168982,"MASCOT Score",25.5800000,,-0.2971787,0.3306692,NO,0.081880003213882,-2.0932230
HVDEHKSGEHKEGIVDK,ph,S,38,true,"LAXIC - mannitol vs control",84b,23660473,XCorr,2.1400000,1.0000000,,,,0.00026823399821296,
HVDEHKSGEHKEGIVDK,ph,S,38,true,"SnRK2 protein kinase substrates",85,23776212,XCorr,3.7659340,1.0000000,,,,0.00099618104286492,
SGEHKEGIVDK,ph,S,38,true,"Tissue atlas Arabidopsis - ProteomicsDB",114,32188942,"MaxQuant score",271.9400000,1.0000000,,,,0,
SGEHKEGIVDK,cr,K,42,true,"Open search Plant PTM Viewer 2.0 - Crotonylation",164c,TBA,,,,,,,,
EGIVDKIK,ac,K,48,true,"Histone deacetylases substrates - hda14 vs WT",98e,29061669,"MaxQuant Score",55.0000000,1.0000000,0.9760000,0.6338697,NO,0.023000000044703,
IHGGEGKSHDGEGK,ac,K,59,true,"Quantitative Acetylproteomics",101,29440448,,,,,,,,
IHGGEGKSHDGEGK,ph,S,60,true,"SnRK2 protein kinase substrates",85,23776212,XCorr,2.0183904,1.0000000,,,,0.039074599742889,
IHGGEGKSHDGEGK,ph,S,60,true,"Tissue atlas Arabidopsis - ProteomicsDB",114,32188942,"MaxQuant score",195.3600000,1.0000000,,,,3.6237400714898E-36,
SHDGEGKSHDGEK,ac,K,66,true,"Quantitative Acetylproteomics",101,29440448,,,,,,,,
SHDGEGKSHDGEKK,ph,S,67,true,"SnRK2 protein kinase substrates",85,23776212,XCorr,2.4677439,1.0000000,,,,0.026113199070096,
SHDGEGKSHDGEK,ph,S,67,true,"SnRK2 protein kinase substrates",85,23776212,XCorr,3.5558808,1.0000000,,,,1.4866199937735E-10,
SHDGEGKSHDGEK,ph,S,67,true,"Tissue atlas Arabidopsis - ProteomicsDB",114,32188942,"MaxQuant score",131.7200000,1.0000000,,,,1.5587900634273E-5,
HHDDGHHSSSSDSDSD,ph,S,92,true,"SnRK2 protein kinase substrates",85,23776212,XCorr,3.2207279,0.8170000,,,,0.0132318995893,
