Peptide,PTM,ModifiedAA,ModifiedPosition,PeptideUniqueToGene,ExperimentDesc,ExpID,PubmedID,ScoreType,IdentScore,LocProb,Log2FChange,PQ-val,QuantSig,PEP,MassErrorPPM
SSNTASSSAG,nt,S,2,true,"N-term acetylation drought responses",5,26184543,,,,,,,,
SSNTASSSAGAAGSGDSSAAR,nta,S,2,true,"Characterization plant N-terminal acetylation",6,22223895,"MASCOT Score",95.0100000,,,,,,
SSNTASSSAGAAGSGDSSAAR,nta,S,2,true,"Arg/N-end rule pathway Roots",80,25728785,"MASCOT Score",23.2500000,,,,,0.0027509999927133,
SSNTASSSAGAAGSGDSSAAR,nta,S,2,true,"Arabidopsis translation initiation landscape - NTA",167a,35069635,,,,,,,,
SSNTASSSAG,nta,S,2,true,"N-term acetylation drought responses",5,26184543,,,,,,,,
VAYIQGDGDKVCNR,acy,C,107,true,"Arabidopsis S-acylation atlas - Leaf",163c,35681017,,,,,,,,
VAYIQGDGDKVCNR,acy,C,107,true,"Arabidopsis S-acylation atlas - Seedling",163d,35681017,,,,,,,,
VAYIQGDGDKVCNR,acy,C,107,true,"Arabidopsis S-acylation atlas - Silique",163e,35681017,,,,,,,,
VAYIQGDGDKVCNR,acy,C,107,true,"Arabidopsis S-acylation atlas - Stem",163f,35681017,,,,,,,,
NNVSLAVNKK,ng,N,190,true,"Conserved N-glycosylation",74,22633491,"MaxQuant Score",178.6600000,0.8970000,,,,1.1879999588238E-11,0.1260000
NNVSLAVNKK,ng,N,190,true,"N-linked Glycan Micro-heterogeneity Arabidopsis",134,29237727,,,,,,,,
NNVSLAVNKK,ng,N,190,true,"UDP-GlcNAc transporter glycopeptide analysis",135,30224661,,,,,,,1.3435191847933E-10,0.7000000
NNVSLAVNK,ng,N,190,true,"UDP-GlcNAc transporter glycopeptide analysis",135,30224661,,,,,,,1.2126061847084E-5,0.7000000
VFPKNFQK,ac,K,217,false,"Quantitative Acetylproteomics",101,29440448,,,,,,,,
NFQKGNITGGATLDPR,ng,N,223,true,"N-Glycopeptide Profiling in Arabidopsis Infloresce",132,27067053,"MOWSE score",35.6000000,,,,,0.00026000000070781,
GNITGGATLDPR,ng,N,223,true,"Conserved N-glycosylation",74,22633491,"MaxQuant Score",125.4800000,1.0000000,,,,2.3910000715444E-11,0.0190000
GNITGGATLDPR,ng,N,223,true,"N-linked Glycan Micro-heterogeneity Arabidopsis",134,29237727,,,,,,,,
GNITGGATLDPR,ng,N,223,true,"UDP-GlcNAc transporter glycopeptide analysis",135,30224661,,,,,,,1.080555783739E-10,0.4000000
