Peptide,PTM,ModifiedAA,ModifiedPosition,PeptideUniqueToGene,ExperimentDesc,ExpID,PubmedID,ScoreType,IdentScore,LocProb,Log2FChange,PQ-val,QuantSig,PEP,MassErrorPPM
AGSAPEGTQFDTR,nt,A,2,true,"Arg/N-end rule pathway Roots",80,25728785,"MASCOT Score",68.1900000,,,,,0.00026500000967644,
AGSAPEGTQFDTR,nt,A,2,true,"N-terminal ChaFRADIC",92,26010716,"MASCOT Score",60.9900000,,,,,0.00033650000113994,
AGSAPEGTQFDTR,nt,A,2,true,"Stromal N-terminome",96,26371235,"MASCOT Score",47.1200000,,,,,,
AGSAPEGTQFDTR,nt,A,2,true,"Arg/N-end rule seed, prt6 vs. Wt",99,29168982,"MASCOT Score",71.4900000,,-0.1213267,0.2736545,NO,0.0023139999248087,-2.3585276
AGSAPEGTQF,nt,A,2,false,"N-term acetylation drought responses",5,26184543,,,,,,,,
AGSAPEGTQF,nt,A,2,false,"Arg/N-end rule seed, prt6 vs. Wt",99,29168982,"MASCOT Score",45.1800000,,,,,0.052000001072884,-3.2811478
AGSAPEGTQFDTRQFDQRLN,nta,A,2,true,"HUNTER N-terminome: legumain, GluC and trypsin",119,31951383,"MaxQuant score",79.8750000,,,,,,
AGSAPEGTQFDTRQFD,nta,A,2,true,"HUNTER N-terminome: legumain, GluC and trypsin",119,31951383,"MaxQuant score",159.0800000,,,,,,
AGSAPEGTQFDTRQF,nta,A,2,true,"Arabidopsis translation initiation landscape - NTA",167a,35069635,,,,,,,,
AGSAPEGTQFDTR,nta,A,2,true,"Characterization plant N-terminal acetylation",6,22223895,"MASCOT Score",77.4400000,,,,,,
AGSAPEGTQFDTR,nta,A,2,true,"Arg/N-end rule pathway Roots",80,25728785,"MASCOT Score",56.5700000,,,,,0.00013479999324773,
AGSAPEGTQFDTR,nta,A,2,true,"N-terminal ChaFRADIC",92,26010716,"MASCOT Score",60.9900000,,,,,0.00033650000113994,
AGSAPEGTQFDTR,nta,A,2,true,"Stromal N-terminome",96,26371235,"MASCOT Score",47.1200000,,,,,,
AGSAPEGTQFDTR,nta,A,2,true,"Arg/N-end rule seed, prt6 vs. Wt",99,29168982,"MASCOT Score",71.4900000,,,,,0.0023139999248087,-2.3585276
AGSAPEGTQFDTR,nta,A,2,true,"FtsH12 N-terminome: WT / FtsH12 knockdown miRNA",118,33216923,"MaxQuant score",47.5070000,,-0.3052897,0.2307902,NO,5.6000000192569E-9,
AGSAPEGTQFDTR,nta,A,2,true,"HUNTER N-terminome: legumain, GluC and trypsin",119,31951383,"MaxQuant score",218.7500000,,,,,,
AGSAPEGTQFD,nta,A,2,false,"HUNTER N-terminome: legumain, GluC and trypsin",119,31951383,"MaxQuant score",153.1000000,,,,,,
AGSAPEGTQF,nta,A,2,false,"N-term acetylation drought responses",5,26184543,,,,,,,,
AGSAPEGTQFDTR,ph,S,4,true,"Pollen phosphoproteome Arabidopsis",43,22631563,"MASCOT Score",61.2400000,,,,,,-2.1066700
AGSAPEGTQFDTR,ph,S,4,true,"atm and atr DNA damage response",88,25561503,"MASCOT Score",49.0000000,0.9900000,,,,,0.4400000
AGSAPEGTQFDTR,ph,S,4,true,"Lateral root-induction - NAA vs control",106,23328941,"MASCOT Score",23.0000000,,,,,,
AGSAPEGTQFDTR,ph,S,4,true,"Phospho cell culture sucrose/TOR",109,30833711,,,0.9999930,,,,,
AGSAPEGTQFDTR,ph,S,4,true,"Tissue atlas Arabidopsis - ProteomicsDB",114,32188942,"MaxQuant score",153.7000000,1.0000000,,,,6.5249402325662E-8,
AGSAPEGTQFDTR,ph,T,9,true,"Lateral root-induction - NAA vs control",106,23328941,"MASCOT Score",20.0000000,,,,,,
AGSAPEGTQFDTR,ph,T,13,true,"Tissue atlas Arabidopsis - ProteomicsDB",114,32188942,"MaxQuant score",86.4970000,0.9475610,,,,0.0002156289992854,
SFDAMGLQENLLR,nt,S,40,false,"Arabidopsis translation initiation landscape - NT",167b,35069635,,,,,,,,
GIYAYGFEKPSAIQQRGIVPFCKGL,nt,G,53,false,"Arabidopsis translation initiation landscape - NT",167b,35069635,,,,,,,,
GIYAYGFEKPSAIQQR,ac,K,61,false,"Histone deacetylases - apicidin vs control",98a,29061669,"MaxQuant Score",82.5000000,1.0000000,0.0250000,0.8830799,NO,0.00042999998549931,
GIYAYGFEKPSAIQQR,ac,K,61,false,"Histone deacetylases substrates - hda14 vs WT",98e,29061669,"MaxQuant Score",70.9000000,1.0000000,0.1410000,0.9099133,NO,1.7999999499807E-6,
GIYAYGFEKPSAIQQR,ub,K,61,false,"upl3 mutant / wildtype",168,35926874,"MaxQuant score",95.5700000,1.0000000,-0.0513992,,,3.5638499866764E-6,-0.5288200
GIVPFCK,ox,C,74,false,"OxiTRAQ Arabidopsis - 5 mM H2O2 versus control",47,24376095,,,,0.2571585,0.2586913,NO,,
GIVPFCK,sno,C,74,false,"hot5-4 / wildtype, FAT-switch S-nitrosoproteome",169,37277371,,,,,,,,
GIVPFCK,so,C,74,false,"S-sulfenylation site detection using YAP1C",110,32714340,,,,,,,,
GIVPFCKGLDVIQQAQSGTGK,ub,K,75,false,"upl3 mutant / wildtype",168,35926874,"MaxQuant score",108.1300000,1.0000000,0.6888517,0.3307800,NO,2.5238399911642E-11,-1.2357000
GLDVIQQAQSGTGK,ph,S,85,false,"Tissue atlas Arabidopsis - ProteomicsDB",114,32188942,"MaxQuant score",165.3600000,0.7751440,,,,1.3915799935982E-11,
GLDVIQQAQSGTGK,ph,T,87,false,"Large-scale phosphorylation discovery",44,23111157,XCorr,4.1170000,,,,,,
ALVLAPTRE,nt,A,110,false,"Arg/N-end rule seed, prt6 vs. Wt",99,29168982,"MASCOT Score",33.9900000,,-0.1157347,0.6123560,NO,0.015629999339581,-0.2473857
ALVLAPTR,nt,A,110,false,"Arg/N-end rule seed, prt6 vs. Wt",99,29168982,"MASCOT Score",33.3700000,,,,,0.18189999461174,-0.0958566
ALVLAPTR,nt,A,110,false,"FtsH12 N-terminome: WT / FtsH12 knockdown miRNA",118,33216923,"MaxQuant score",59.7090000,,-0.3999718,0.0148581,NO,0.004095199983567,
ELAQQIEKVMR,ac,K,125,false,"Histone deacetylases - apicidin vs control",98a,29061669,"MaxQuant Score",125.5000000,1.0000000,0.0270000,0.9036495,NO,2.3999999210211E-10,
ELAQQIEKVMR,ac,K,125,false,"Histone deacetylases substrates - TSA vs control",98b,29061669,"MaxQuant Score",125.5000000,1.0000000,-0.5370000,0.5902011,NO,2.3999999210211E-10,
ELAQQIEKVMR,ac,K,125,false,"Histone deacetylases- hda14 vs WT (low light)",98c,29061669,"MaxQuant Score",161.4800000,1.0000000,-0.9960000,0.9885531,NO,1.900000029309E-6,
ELAQQIEKVMR,ac,K,125,false,"Histone deacetylases substrates - hda14 vs WT",98e,29061669,"MaxQuant Score",118.9000000,1.0000000,0.0360000,0.9289664,NO,4.3000000261861E-12,
ELAQQIEKVMR,ac,K,125,false,"Quantitative Acetylproteomics",101,29440448,,,,,,,,
ELAQQIEKVMR,ub,K,125,false,"Arabidopsis ubiquitination COFRADIC",40,26744219,"MaxQuant Score",111.8600000,1.0000000,,,,5.8139999481455E-8,1.8920000
ELAQQIEKVMR,ub,K,125,false,"upl3 mutant / wildtype",168,35926874,"MaxQuant score",64.9180000,1.0000000,0.6516832,,,0.001298820017837,2.6171000
VHACVGGTSVR,sno,C,141,false,"Site-specific nitrosomeproteomic id - gsnor1-3",90a,25699590,XCorr,2.8587055,,,,,0.00039279999327846,-6.8108735
VHACVGGTSVR,sno,C,141,false,"Site-specific nitrosomeproteomic id - gsnor1-3",90b,25699590,XCorr,2.6900000,,,,,0.035939998924732,-5.1900000
VHACVGGTSVR,sno,C,141,false,"hot5-4 / wildtype, FAT-switch S-nitrosoproteome",169,37277371,,,,,,,,
VHACVGGTSVR,so,C,141,false,"Arabidopsis S-sulfenylation chemoproteomics",108,31578252,"pFind PSM Score",0.0033162,,1.1634300,,,,0.7186838
VHACVGGTSVR,so,C,141,false,"S-sulfenylation site detection using YAP1C",110,32714340,,,,,,,,
VHACVGGTSVREDQR,ph,T,145,false,"Arabidopsis root NAA phosphoproteome",18a,27643528,"MaxQuant Score",101.3000000,0.9610000,,,,4.6540001019668E-11,-0.2570000
VHACVGGTSVREDQR,ph,T,145,false,"Phosphoproteome ethylene-regulated time response",46,24043427,"MASCOT Score",45.8300000,,,,,,-6.9353000
VHACVGGTSVREDQR,ph,T,145,false,"srk2dei ABA signaling phopshoproteomics",83,23572148,"MASCOT Score",67.0000000,,,,,,-0.0016000
VHACVGGTSVREDQR,ph,T,145,false,"Brassinosteroid-Regulated Phosphorylation Dynamics",94,26187819,"MaxQuant Score",124.2900000,0.9970000,,,,3.7420001319788E-8,1.0460000
VHACVGGTSVREDQR,ph,T,145,false,"Protein sumoylation and phosphorylation cross-talk",97,28419593,,,,,,,,
VHACVGGTSVREDQR,ph,T,145,false,"TOR Kinase and ABA Receptor",100,29290610,XCorr,2.5213079,0.8617000,,,,0.087360002100468,
VHACVGGTSVR,ph,T,145,false,"Phosphoproteome iron-deficient Arabidopsis roots",41,22438062,"MASCOT Score",33.2200000,,,,,,
VHACVGGTSVR,ph,T,145,false,"Phosphoproteome ethylene-regulated time response",46,24043427,"MASCOT Score",67.9500000,,,,,,27.1290000
VHACVGGTSVR,ph,T,145,false,"Tyrosine phosphorylation in Arabidopsis",59,18463617,"MASCOT Score",54.0000000,,,,,,-0.8186445
VHACVGGTSVR,ph,T,145,false,"Conserved plant phosphoproteome - Arabidopsis",61a,20466843,"MASCOT Score",54.0000000,1.0000000,,,,,
VHACVGGTSVR,ph,T,145,false,"srk2dei ABA signaling phopshoproteomics",83,23572148,"MASCOT Score",67.0000000,,,,,,0.0004000
VHACVGGTSVR,ph,T,145,false,"SnRK2 protein kinase substrates",85,23776212,XCorr,3.5135131,0.9980000,,,,8.7281604166378E-9,
VHACVGGTSVR,ph,T,145,false,"atm and atr DNA damage response",88,25561503,"MASCOT Score",59.0000000,0.9630000,,,,,0.0000000
VHACVGGTSVR,ph,T,145,false,"Lateral root-induction - NAA vs control",106,23328941,"MASCOT Score",45.0000000,,-0.3548468,0.0839405,NO,,
VHACVGGTSVR,ph,T,145,false,"Col-0 callus - FC Col-0 vs. Col-0 Xray",111a,31410901,,49.7700000,,-1.3867422,0.0000000,NO,,2.2887770
VHACVGGTSVR,ph,T,145,false,"Col-0 X-ray callus - FC Col-0 vs. Col-0 Xray",111b,31410901,,49.7700000,,-1.3867422,0.0000000,NO,,2.2887770
VHACVGGTSVR,ph,T,145,false,"atm callus - FC atm vs. atm Xray",111c,31410901,,49.7700000,,-1.4464308,0.0000000,NO,,2.2887770
VHACVGGTSVR,ph,T,145,false,"atm-3 X-ray callus - FC atm vs. atm Xray",111d,31410901,,49.7700000,,-1.4464308,0.0000000,NO,,2.2887770
VHACVGGTSVR,ph,T,145,false,"Tissue atlas Arabidopsis - ProteomicsDB",114,32188942,"MaxQuant score",231.6600000,1.0000000,,,,1.5362435064393E-41,
VHACVGGTSVREDQR,ph,S,146,false,"srk2dei ABA signaling phopshoproteomics",83,23572148,"MASCOT Score",69.0000000,,,,,,-0.0004000
VHACVGGTSVREDQR,ph,S,146,false,"SnRK2 protein kinase substrates",85,23776212,XCorr,2.2997236,0.9210000,,,,0.00068489398108795,
VHACVGGTSVREDQR,ph,S,146,false,"Brassinosteroid-Regulated Phosphorylation Dynamics",94,26187819,"MaxQuant Score",148.4400000,0.9560000,,,,6.4570000586331E-24,0.8810000
VHACVGGTSVREDQR,ph,S,146,false,"Phospho cell culture sucrose/TOR",109,30833711,,,1.0000000,,,,,
VHACVGGTSVR,ph,S,146,false,"Immuno-dot blot phosphorylation",31,19341826,"MASCOT Score",46.7900000,,,,,,
VHACVGGTSVR,ph,S,146,false,"Phosphoproteome ethylene-regulated time response",46,24043427,"MASCOT Score",48.6300000,,,,,,3.5909000
VHACVGGTSVR,ph,S,146,false,"atm and atr DNA damage response",88,25561503,"MASCOT Score",36.0000000,0.9980000,,,,,0.6200000
VHACVGGTSVR,ph,S,146,false,"Tissue atlas Arabidopsis - ProteomicsDB",114,32188942,"MaxQuant score",232.4800000,1.0000000,,,,2.9861670274762E-42,
QSLRPDCIK,sno,C,181,true,"hot5-4 / wildtype, FAT-switch S-nitrosoproteome",169,37277371,,,,0.9960085,0.0003235,YES,,
QSLRPDCIK,so,C,181,true,"Arabidopsis S-sulfenylation chemoproteomics",108,31578252,"pFind PSM Score",0.2302780,,0.9902000,,,,0.4434819
QSLRPDCIK,so,C,181,true,"S-sulfenylation site detection using YAP1C",110,32714340,,,,,,,,
AITQSVIFVNTR,nt,A,277,false,"FtsH12 N-terminome: WT / FtsH12 knockdown miRNA",118,33216923,"MaxQuant score",136.0100000,,-0.2817884,0.0380772,NO,6.5199999003048E-29,
KVDWLTDKMR,ac,K,297,false,"Quantitative Acetylproteomics",101,29440448,,,,,,,,
VDWLTDKMR,ac,K,297,false,"Quantitative Acetylproteomics",101,29440448,,,,,,,,
SRDHTVSATHGDMDQNTRD,nt,S,300,false,"Arabidopsis translation initiation landscape - NT",167b,35069635,,,,,,,,
DHTVSATHGDMDQNTR,nt,D,302,false,"Arabidopsis translation initiation landscape - NT",167b,35069635,,,,,,,,
DHTVSATHGDMDQNTR,nta,D,302,false,"Arabidopsis translation initiation landscape - NTA",167a,35069635,,,,,,,,
ATHGDMDQNTR,nt,A,307,false,"Arg/N-end rule seed, prt6 vs. Wt",99,29168982,"MASCOT Score",23.3700000,,,,,0.030330000445247,-2.5357919
