Peptide,PTM,ModifiedAA,ModifiedPosition,PeptideUniqueToGene,ExperimentDesc,ExpID,PubmedID,ScoreType,IdentScore,LocProb,Log2FChange,PQ-val,QuantSig,PEP,MassErrorPPM
FMRIPIVIPPALQPNVNVSR,ng,N,105,true,"N-glycan occupancy Arabidopsis glycoproteins",87,23994444,"Ladder score",53.8000000,,,,,,
IPIVIPPALQPNVNVSR,ng,N,105,true,"Conserved N-glycosylation",74,22633491,"MaxQuant Score",181.4600000,0.9830000,,,,0,0.1720000
IPIVIPPALQPNVNVSR,ng,N,105,true,"N-glycan occupancy Arabidopsis glycoproteins",87,23994444,"Ladder score",75.8000000,,,,,,
IPIVIPPALQPNVNVSR,ng,N,105,true,"N-linked Glycan Micro-heterogeneity Arabidopsis",134,29237727,,,,,,,,
IPIVIPPALQPNVNVSR,ng,N,105,true,"UDP-GlcNAc transporter glycopeptide analysis",135,30224661,,,,,,,4.0252293143604E-14,-0.1000000
APVESLTLNQQVR,nt,A,122,true,"Tic56 chloroplast import - tic56-1",89c,25588737,XCorr,2.7735612,,,,,,
IGANDYLNFTK,ng,N,165,false,"N-glycan occupancy Arabidopsis glycoproteins",87,23994444,"Ladder score",82.5000000,,,,,,
LKNDISLLYSSGASK,ac,K,190,true,"Quantitative Acetylproteomics",101,29440448,,,,,,,,
TLAPLGCLPIVR,nt,T,208,false,"Arg/N-end rule pathway Roots",80,25728785,"MASCOT Score",44.9300000,,,,,3.285999991931E-5,
TLAPLGCLPIVR,nta,T,208,false,"FtsH12 N-terminome: WT / FtsH12 knockdown miRNA",118,33216923,"MaxQuant score",97.7670000,,,,,0.00039728998672217,
FFVTNASCCGVGTHDAYGCGFPNVHSR,ng,N,288,true,"Conserved N-glycosylation",74,22633491,"MaxQuant Score",330.6600000,1.0000000,,,,0,-0.2140000
FFVTNASCCGVGTHDAYGCGFPNVHSR,ng,N,288,true,"ER-associatied N-glycan degradation chilling stres",133,27558752,,,,,,,,
GFPNVHSRLCE,nt,G,303,true,"Arg/N-end rule seed, prt6 vs. Wt",99,29168982,"MASCOT Score",21.9000000,,-0.1285051,0.5593198,NO,0.00058160000480711,0.0696376
LCEYQR,sno,C,312,false,"hot5-4 / wildtype, FAT-switch S-nitrosoproteome",169,37277371,,,,,,,,
SYLFFDGR,nt,S,317,true,"N-terminal ChaFRADIC",92,26010716,"MASCOT Score",33.1000000,,,,,0.00087910000002012,
SYLFFDGR,nt,S,317,true,"Arg/N-end rule seed, prt6 vs. Wt",99,29168982,"MASCOT Score",42.7500000,,-0.4382821,0.0018839,NO,0.1123000010848,-0.8251063
ELVVYPADEPMR,nt,E,353,true,"Arg/N-end rule pathway Roots",80,25728785,"MASCOT Score",27.1300000,,,,,0.053769998252392,
