Peptide,PTM,ModifiedAA,ModifiedPosition,PeptideUniqueToGene,ExperimentDesc,ExpID,PubmedID,ScoreType,IdentScore,LocProb,Log2FChange,PQ-val,QuantSig,PEP,MassErrorPPM
IPLAIAPALQPNVNVSR,ng,N,105,true,"Conserved N-glycosylation",74,22633491,"MaxQuant Score",189.6600000,0.7850000,,,,0,0.7440000
IPLAIAPALQPNVNVSR,ng,N,105,true,"N-glycan occupancy Arabidopsis glycoproteins",87,23994444,"Ladder score",66.7000000,,,,,,
IPLAIAPALQPNVNVSR,ng,N,105,true,"ER-associatied N-glycan degradation chilling stres",133,27558752,,,,,,,,
IPLAIAPALQPNVNVSR,ng,N,105,true,"N-linked Glycan Micro-heterogeneity Arabidopsis",134,29237727,,,,,,,,
IPLAIAPALQPNVNVSR,ng,N,105,true,"UDP-GlcNAc transporter glycopeptide analysis",135,30224661,,,,,,,1.1252764128486E-12,0.3000000
IGANDYLNFTK,ng,N,165,false,"N-glycan occupancy Arabidopsis glycoproteins",87,23994444,"Ladder score",82.5000000,,,,,,
LKNDISALYSSGASK,ac,K,190,true,"Quantitative Acetylproteomics",101,29440448,,,,,,,,
TLAPLGCLPIVR,nt,T,208,false,"Arg/N-end rule pathway Roots",80,25728785,"MASCOT Score",44.9300000,,,,,3.285999991931E-5,
TLAPLGCLPIVR,nta,T,208,false,"FtsH12 N-terminome: WT / FtsH12 knockdown miRNA",118,33216923,"MaxQuant score",97.7670000,,,,,0.00039728998672217,
FFVTNASCCGVGSHDAYGCGLPNVHSK,ng,N,288,true,"Conserved N-glycosylation",74,22633491,"MaxQuant Score",273.2700000,1.0000000,,,,0,-0.5980000
FFVTNASCCGVGSHDAYGCGLPNVHSK,ng,N,288,true,"ER-associatied N-glycan degradation chilling stres",133,27558752,,,,,,,,
LCEYQR,sno,C,312,false,"hot5-4 / wildtype, FAT-switch S-nitrosoproteome",169,37277371,,,,,,,,
