Peptide,PTM,ModifiedAA,ModifiedPosition,PeptideUniqueToGene,ExperimentDesc,ExpID,PubmedID,ScoreType,IdentScore,LocProb,Log2FChange,PQ-val,QuantSig,PEP,MassErrorPPM
MDSVNSFKGYGK,ph,S,6,true,"Arabidopsis root NAA phosphoproteome",18a,27643528,"MaxQuant Score",74.7890000,0.9990000,,,,1.2110000398025E-6,-1.3900000
MDSVNSFKGYGK,ph,S,6,true,"SIRK1 phosphorylation",86a,23820729,"MaxQuant Score",224.0000000,1.0000000,,,,5.229999850624E-14,1.7310000
MDSVNSFKGYGK,ph,S,6,true,"SIRK1 exp - sirk1 mutant vs WT",86b,23820729,,,,-0.3241371,,NO,,
MDSVNSFKGYGK,ph,S,6,true,"SIRK1 exp - 35S:SIRK1 vs WT",86c,23820729,,,,-0.7781132,,NO,,
MDSVNSFKGYGK,ph,S,6,true,"atm and atr DNA damage response",88,25561503,"MASCOT Score",50.0000000,0.9960000,,,,,2.2600000
MDSVNSFKGYGK,ph,S,6,true,"Phospho cell culture sucrose/TOR",109,30833711,,,1.0000000,,,,,
MDSVNSFKGYGK,ph,S,6,true,"Tissue atlas Arabidopsis - ProteomicsDB",114,32188942,"MaxQuant score",297.7200000,1.0000000,,,,0,
MDSVNSFK,ph,S,6,true,"atm and atr DNA damage response",88,25561503,"MASCOT Score",45.0000000,1.0000000,,,,,0.0100000
MDSVNSFK,ph,S,6,true,"TOR Kinase and ABA Receptor",100,29290610,XCorr,2.6407378,1.0000000,,,,0.0026829999405891,
MDSVNSFKGYGK,ub,K,8,true,"upl3 mutant / wildtype",168,35926874,"MaxQuant score",86.9110000,1.0000000,0.7381193,,,0.00010635500075296,-1.6282000
GYGKVDEAQDLALK,ub,K,12,true,"upl3 mutant / wildtype",168,35926874,"MaxQuant score",63.2900000,1.0000000,-0.6038405,0.4755400,NO,0.00046153800212778,1.5431000
AICSVTR,ox,C,77,true,"OxiTRAQ Arabidopsis - 5 mM H2O2 versus control",47,24376095,,,,-0.3778256,0.0600942,NO,,
FPESCISSISK,sno,C,86,true,"hot5-4 / wildtype, FAT-switch S-nitrosoproteome",169,37277371,,,,0.5959699,0.0092193,YES,,
LPSSNTTDPETLFK,ng,N,97,true,"Conserved N-glycosylation",74,22633491,"MaxQuant Score",148.9900000,1.0000000,,,,2.9829998595979E-26,-0.5770000
LPSSNTTDPETLFK,ng,N,97,true,"N-linked Glycan Micro-heterogeneity Arabidopsis",134,29237727,,,,,,,,
LPSSNTTDPETLFK,ng,N,97,true,"UDP-GlcNAc transporter glycopeptide analysis",135,30224661,,,,,,,9.1265807845159E-14,0.8000000
VCGDLIEDALDRLNDTVSAIDDEEKK,ng,N,154,true,"Conserved N-glycosylation",74,22633491,"MaxQuant Score",220.6700000,1.0000000,,,,0,-0.0720000
LNDTVSAIDDEEKKK,ng,N,154,true,"UDP-GlcNAc transporter glycopeptide analysis",135,30224661,,,,,,,2.0082710722267E-14,1.0000000
LNDTVSAIDDEEKK,ng,N,154,true,"UDP-GlcNAc transporter glycopeptide analysis",135,30224661,,,,,,,5.3290754919999E-8,2.9000000
LNDTVSAIDDEEK,ng,N,154,true,"N-linked Glycan Micro-heterogeneity Arabidopsis",134,29237727,,,,,,,,
LNDTVSAIDDEEK,ng,N,154,true,"UDP-GlcNAc transporter glycopeptide analysis",135,30224661,,,,,,,1.4898830866944E-12,-0.1000000
TWLSATVTDHETCFDSLDELKQNK,ng,N,201,true,"Conserved N-glycosylation",74,22633491,"MaxQuant Score",193.9800000,1.0000000,,,,0,-0.9540000
TEYANSTITQNLK,ng,N,207,true,"Conserved N-glycosylation",74,22633491,"MaxQuant Score",162.3300000,1.0000000,,,,1.5480000558882E-22,-0.5000000
TEYANSTITQNLK,ng,N,207,true,"N-linked Glycan Micro-heterogeneity Arabidopsis",134,29237727,,,,,,,,
TEYANSTITQNLK,ng,N,207,true,"UDP-GlcNAc transporter glycopeptide analysis",135,30224661,,,,,,,2.4897438297409E-17,0.7000000
