Peptide,PTM,ModifiedAA,ModifiedPosition,PeptideUniqueToGene,ExperimentDesc,ExpID,PubmedID,ScoreType,IdentScore,LocProb,Log2FChange,PQ-val,QuantSig,PEP,MassErrorPPM
HTHILDDPFDDPPQLAEMMPDASPEGKPKEEVK,ph,S,180,true,"Tissue atlas Arabidopsis - ProteomicsDB",114,32188942,"MaxQuant score",192.9800000,1.0000000,,,,0,
HTHILDDPFDDPPQLAEMMPDASPEGKPK,ph,S,180,true,"Arabidopsis root NAA phosphoproteome",18a,27643528,"MaxQuant Score",74.2820000,1.0000000,,,,1.4860000341343E-8,-0.9120000
HTHILDDPFDDPPQLAEMMPDASPEGKPK,ph,S,180,true,"Large-scale phosphorylation discovery",44,23111157,XCorr,6.0590000,,,,,,
HTHILDDPFDDPPQLAEMMPDASPEGKPK,ph,S,180,true,"TOR Kinase and ABA Receptor",100,29290610,XCorr,5.2455349,1.0000000,,,,1.8590000649965E-8,
DCVGGPSSKFIVK,ac,K,362,true,"Lysine acetylation gel-based Finkemeier et al",37,21311031,i-probability,0.5912100,,,,,,
QHGGGEGYEMVFEGDVHETPK,ph,T,389,true,"Tissue atlas Arabidopsis - ProteomicsDB",114,32188942,"MaxQuant score",40.3540000,0.9998620,,,,0.0061639198102057,
RSPHGNGEGK,ph,S,407,true,"atm and atr DNA damage response",88,25561503,"MASCOT Score",39.0000000,1.0000000,,,,,-0.7100000
SPHGNGEGKR,ph,S,407,true,"atm and atr DNA damage response",88,25561503,"MASCOT Score",31.0000000,1.0000000,,,,,-1.7400000
