Peptide,PTM,ModifiedAA,ModifiedPosition,PeptideUniqueToGene,ExperimentDesc,ExpID,PubmedID,ScoreType,IdentScore,LocProb,Log2FChange,PQ-val,QuantSig,PEP,MassErrorPPM
RLDSQIQRTPNDESLSNGSSSTDDNQEGSK,ph,S,483,true,"srk2dei ABA signaling phopshoproteomics",83,23572148,"MASCOT Score",24.0000000,,,,,,-0.0066000
RLDSQIQR,ph,S,483,true,"STN8 phosphoproteome",38,21768351,"MASCOT Score",43.6100000,,,,,,0.0780799
RLDSQIQR,ph,S,483,true,"Chloroplast kinase substrates",60,19376835,"MASCOT Score",41.0800000,,,,,,2.3215000
RLDSQIQR,ph,S,483,true,"atm and atr DNA damage response",88,25561503,"MASCOT Score",45.0000000,1.0000000,,,,,0.2500000
RLDSQIQR,ph,S,483,true,"TOR Kinase and ABA Receptor",100,29290610,XCorr,3.3684719,1.0000000,,,,0.026049999520183,
RLDSQIQR,ph,S,483,true,"Phospho cell culture sucrose/TOR",109,30833711,,,1.0000000,,,,,
RLDSQIQR,ph,S,483,true,"Col-0 callus - FC Col-0 vs. Col-0 Xray",111a,31410901,,28.0300000,,-0.3844826,0.0000000,NO,,-0.3298999
RLDSQIQR,ph,S,483,true,"Col-0 X-ray callus - FC Col-0 vs. Col-0 Xray",111b,31410901,,28.0300000,,-0.3844826,0.0000000,NO,,-0.3298999
RLDSQIQR,ph,S,483,true,"atm callus - FC atm vs. atm Xray",111c,31410901,,28.0300000,,1.0136466,0.0000000,NO,,-0.3298999
RLDSQIQR,ph,S,483,true,"atm-3 X-ray callus - FC atm vs. atm Xray",111d,31410901,,28.0300000,,1.0136466,0.0000000,NO,,-0.3298999
RLDSQIQR,ph,S,483,true,"Tissue atlas Arabidopsis - ProteomicsDB",114,32188942,"MaxQuant score",209.0300000,1.0000000,,,,7.804760120524E-14,
KIGSMFHR,ph,S,524,true,"Tissue atlas Arabidopsis - ProteomicsDB",114,32188942,"MaxQuant score",117.8900000,1.0000000,,,,0.0041901199147105,
IGSMFHR,ph,S,524,true,"Tyrosine phosphorylation in Arabidopsis",59,18463617,"MASCOT Score",39.0000000,,,,,,-0.6476804
IGSMFHR,ph,S,524,true,"Conserved plant phosphoproteome - Arabidopsis",61a,20466843,"MASCOT Score",39.0000000,1.0000000,,,,,
IGSMFHR,ph,S,524,true,"Phospho cell culture sucrose/TOR",109,30833711,,,1.0000000,,,,,
KEEFLIGSIEEESQSQSPR,ph,S,546,true,"Tissue atlas Arabidopsis - ProteomicsDB",114,32188942,"MaxQuant score",249.5900000,0.9872600,,,,0,
NVKKEEFLIGSIEEESQSQSPR,ph,S,548,true,"STN8 phosphoproteome",38,21768351,"MASCOT Score",45.5800000,,,,,,-1.1886900
KEEFLIGSIEEESQSQSPR,ph,S,548,true,"Arabidopsis root NAA phosphoproteome",18a,27643528,"MaxQuant Score",107.8800000,0.9970000,,,,3.3329998703183E-17,0.3550000
KEEFLIGSIEEESQSQSPR,ph,S,548,true,"Phosphorylation Early Elicitor Signaling",23,17317660,,,,,,,,
KEEFLIGSIEEESQSQSPR,ph,S,548,true,"STN8 phosphoproteome",38,21768351,"MASCOT Score",56.5500000,,,,,,-0.4368760
KEEFLIGSIEEESQSQSPR,ph,S,548,true,"Phosphoproteome ethylene-regulated time response",46,24043427,"MASCOT Score",47.6100000,,,,,,-5.4556000
KEEFLIGSIEEESQSQSPR,ph,S,548,true,"PAMP-triggered phosphorylation",48,24601666,"MASCOT Score",55.9200000,,,,,,
KEEFLIGSIEEESQSQSPR,ph,S,548,true,"Tyrosine phosphorylation in Arabidopsis",59,18463617,"MASCOT Score",50.0000000,,,,,,-2.0686426
KEEFLIGSIEEESQSQSPR,ph,S,548,true,"srk2dei ABA signaling phopshoproteomics",83,23572148,"MASCOT Score",49.0000000,,,,,,0.0009000
KEEFLIGSIEEESQSQSPR,ph,S,548,true,"LAXIC - ABA stress",84a,23660473,XCorr,3.5800000,0.9460000,,,,0.019718399271369,
KEEFLIGSIEEESQSQSPR,ph,S,548,true,"SnRK2 protein kinase substrates",85,23776212,XCorr,4.1744142,1.0000000,,,,0.00023613400117029,
KEEFLIGSIEEESQSQSPR,ph,S,548,true,"TOR Kinase and ABA Receptor",100,29290610,XCorr,5.4078259,0.9979000,,,,3.6290000480221E-6,
KEEFLIGSIEEESQSQSPR,ph,S,548,true,"Phospho cell culture sucrose/TOR",109,30833711,,,0.9816860,,,,,
KEEFLIGSIEEESQSQSPR,ph,S,548,true,"Col-0 callus - FC Col-0 vs. Col-0 Xray",111a,31410901,,72.9500000,,0.2162568,0.0000000,NO,,0.9543113
KEEFLIGSIEEESQSQSPR,ph,S,548,true,"Col-0 X-ray callus - FC Col-0 vs. Col-0 Xray",111b,31410901,,72.9500000,,0.2162568,0.0000000,NO,,0.9543113
KEEFLIGSIEEESQSQSPR,ph,S,548,true,"atm callus - FC atm vs. atm Xray",111c,31410901,,72.9500000,,1.6049882,0.0000000,NO,,0.9543113
KEEFLIGSIEEESQSQSPR,ph,S,548,true,"atm-3 X-ray callus - FC atm vs. atm Xray",111d,31410901,,72.9500000,,1.6049882,0.0000000,NO,,0.9543113
KEEFLIGSIEEESQSQSPR,ph,S,548,true,"Tissue atlas Arabidopsis - ProteomicsDB",114,32188942,"MaxQuant score",350.2900000,0.9999990,,,,0,
KEEFLIGSIEEESQSQSPR,ph,S,548,true,"Touch-induced phosphorylation: 40s touch vs untouc",136,30291188,"MASCOT score",95.1700000,,0.3916971,0.4479050,NO,,6.1346313
EEFLIGSIEEESQSQSPR,ph,S,548,true,"Tyrosine phosphorylation in Arabidopsis",59,18463617,"MASCOT Score",43.0000000,,,,,,-0.1399299
DVGLNFIVDDNLSGPLSGK,ph,S,572,true,"Touch-induced phosphorylation: 40s touch vs untouc",136,30291188,"MASCOT score",75.9700000,,0.2866719,0.4866406,NO,,-1.4650259
SLDGESLDAEENSGK,ph,S,579,true,"atm and atr DNA damage response",88,25561503,"MASCOT Score",103.0000000,1.0000000,,,,,-0.1100000
SLDGESLDAEENSGK,ph,S,579,true,"TOR Kinase and ABA Receptor",100,29290610,XCorr,4.7374463,1.0000000,,,,4.1509998993661E-8,
SLDGESLDAEENSGK,ph,S,579,true,"Lateral root-induction - NAA vs control",106,23328941,"MASCOT Score",66.0000000,,,,,,
SLDGESLDAEENSGK,ph,S,579,true,"Col-0 callus - FC Col-0 vs. Col-0 Xray",111a,31410901,,87.5300000,,0.1036053,0.0000000,NO,,1.2329754
SLDGESLDAEENSGK,ph,S,579,true,"Col-0 X-ray callus - FC Col-0 vs. Col-0 Xray",111b,31410901,,87.5300000,,0.1036053,0.0000000,NO,,1.2329754
SLDGESLDAEENSGK,ph,S,579,true,"atm callus - FC atm vs. atm Xray",111c,31410901,,87.5300000,,-0.7575011,0.0000000,NO,,1.2329754
SLDGESLDAEENSGK,ph,S,579,true,"atm-3 X-ray callus - FC atm vs. atm Xray",111d,31410901,,87.5300000,,-0.7575011,0.0000000,NO,,1.2329754
SLDGESLDAEENSGK,ph,S,579,true,"Tissue atlas Arabidopsis - ProteomicsDB",114,32188942,"MaxQuant score",305.7500000,1.0000000,,,,0,
SLDGESLDAEENSGK,ph,S,584,true,"Tissue atlas Arabidopsis - ProteomicsDB",114,32188942,"MaxQuant score",250.8800000,1.0000000,,,,0,
SLDGESLDAEENSGKGHMK,ph,S,591,true,"Tissue atlas Arabidopsis - ProteomicsDB",114,32188942,"MaxQuant score",184.4200000,1.0000000,,,,2.8142299714588E-25,
TGDDDHVDSTTLATAK,ph,S,682,true,"Tissue atlas Arabidopsis - ProteomicsDB",114,32188942,"MaxQuant score",72.7050000,0.7750940,,,,0.0004455849993974,
EDSSGDILEDSTDVEAK,ph,S,692,true,"Tissue atlas Arabidopsis - ProteomicsDB",114,32188942,"MaxQuant score",226.7000000,0.9509080,,,,0,
EDSSGDILEDSTDVEAKEEK,ph,S,700,true,"Tissue atlas Arabidopsis - ProteomicsDB",114,32188942,"MaxQuant score",319.5500000,0.9592980,,,,0,
EDSSGDILEDSTDVEAKEEK,ph,T,701,true,"Tissue atlas Arabidopsis - ProteomicsDB",114,32188942,"MaxQuant score",254.5300000,0.9193150,,,,0,
EDSSGDILEDSTDVEAK,ph,T,701,true,"srk2dei ABA signaling phopshoproteomics",83,23572148,"MASCOT Score",45.0000000,,,,,,0.0008000
EDSSGDILEDSTDVEAK,ph,T,701,true,"TOR Kinase and ABA Receptor",100,29290610,XCorr,4.8988538,0.9237000,,,,5.7360000937479E-5,
