Peptide,PTM,ModifiedAA,ModifiedPosition,PeptideUniqueToGene,ExperimentDesc,ExpID,PubmedID,ScoreType,IdentScore,LocProb,Log2FChange,PQ-val,QuantSig,PEP,MassErrorPPM
PLRSPPPTFLR,ph,S,29,true,"atm and atr DNA damage response",88,25561503,"MASCOT Score",24.0000000,1.0000000,,,,,-0.9100000
VMGSSSSFSSSSSKLLFR,nt,V,38,true,"Mitochondrial intermediate peptidases - icp55 / WT",131a,25732537,,58.0200000,,-0.4332833,,,,
GSSSSFSSSSSKLLFR,nt,G,40,true,"N-terminal ChaFRADIC",92,26010716,"MASCOT Score",37.5900000,,,,,2.2700000045006E-5,
GSSSSFSSSSSKLLFR,nt,G,40,true,"Stromal N-terminome",96,26371235,"MASCOT Score",91.4500000,,,,,,
GSSSSFSSSSSKLLFR,nt,G,40,true,"Mitochondrial intermediate peptidases - oct1-1 / WT",131b,25732537,,125.2400000,,-0.3479469,,,,
GSSSSFSSSSSKLLFR,nt,G,40,true,"Mitochondrial intermediate peptidases - oct1-2 / WT",131c,25732537,,113.5700000,,-0.1912822,,,,
GSSSSFSSSSSKLLFR,nta,G,40,true,"Arg/N-end rule pathway Roots",80,25728785,"MASCOT Score",91.3800000,,,,,6.5039998276006E-8,
GSSSSFSSSSSKLLFR,nta,G,40,true,"N-terminal ChaFRADIC",92,26010716,"MASCOT Score",37.5900000,,,,,2.2700000045006E-5,
GSSSSFSSSSSKLLFR,nta,G,40,true,"Stromal N-terminome",96,26371235,"MASCOT Score",91.4500000,,,,,,
GSSSSFSSSSSKLLFR,nta,G,40,true,"FtsH12 N-terminome: WT / FtsH12 knockdown miRNA",118,33216923,"MaxQuant score",131.4300000,,,,,3.9100000374769E-17,
GSSSSFSSSSSKLLFR,nta,G,40,true,"HUNTER N-terminome: legumain, GluC and trypsin",119,31951383,"MaxQuant score",103.8800000,,,,,,
GSSSSFSSSSSKLLFR,nta,G,40,true,"Mitochondrial intermediate peptidases - oct1-1 / WT",131b,25732537,,68.2400000,,0.1483211,,,,
GSSSSFSSSSSKLLFR,nta,G,40,true,"Mitochondrial intermediate peptidases - oct1-2 / WT",131c,25732537,,75.9200000,,-0.3268691,,,,
GSSSSFSSSSSKLLFR,nta,G,40,true,"Arabidopsis translation initiation landscape - NTA",167a,35069635,,,,,,,,
GSSSSFSSSSSK,nta,G,40,true,"Characterization plant N-terminal acetylation",6,22223895,"MASCOT Score",61.8300000,,,,,,
SVMGSSSSFSSSSSK,ph,S,44,true,"Tissue atlas Arabidopsis - ProteomicsDB",114,32188942,"MaxQuant score",122.0800000,0.8425210,,,,3.099640025539E-6,
SSSSSKLLFR,nt,S,46,true,"N-terminal ChaFRADIC",92,26010716,"MASCOT Score",30.3000000,,,,,0.00042490000487305,
TKLPGVKSVISK,ac,K,130,true,"Quantitative Acetylproteomics",101,29440448,,,,,,,,
ASGSKADLFLEPGDK,ac,K,140,true,"Quantitative Acetylproteomics",101,29440448,,,,,,,,
ATPGHTAGCVTYVTGEGADQPQPR,sno,C,170,true,"Site-specific nitrosomeproteomic id - gsnor1-3",90a,25699590,XCorr,4.8354354,,,,,6.3480001699645E-8,-2.5276224
ATPGHTAGCVTYVTGEGADQPQPR,sno,C,170,true,"Site-specific nitrosomeproteomic id - gsnor1-3",90b,25699590,XCorr,2.4900000,,,,,2.429999949527E-5,-6.0400000
ATPGHTAGCVTYVTGEGADQPQPR,so,C,170,true,"Arabidopsis S-sulfenylation chemoproteomics",108,31578252,"pFind PSM Score",0.0003410,,,,,,-0.7904639
VTYVTGEGADQPQPR,nt,V,171,true,"Arg/N-end rule seed, prt6 vs. Wt",99,29168982,"MASCOT Score",47.6300000,,0.5079139,0.2918399,NO,0.014729999937117,-2.0061555
DTLIYPAHDYKGFEVSTVGEEMQHNPR,ub,K,235,true,"upl3 mutant / wildtype",168,35926874,"MaxQuant score",86.7910000,1.0000000,-0.7759597,,,1.5136800146642E-10,0.2017900
TIMSNLNLSYPK,ph,S,264,true,"Lateral root-induction - NAA vs control",106,23328941,"MASCOT Score",28.0000000,,,,,,
TIMSNLNLSYPK,ph,S,264,true,"Tissue atlas Arabidopsis - ProteomicsDB",114,32188942,"MaxQuant score",176.4200000,1.0000000,,,,1.3264500378619E-14,
TIMSNLNLSYPK,ph,S,269,true,"atm and atr DNA damage response",88,25561503,"MASCOT Score",42.0000000,0.9960000,,,,,0.3000000
TIMSNLNLSYPK,ph,S,269,true,"Lateral root-induction - NAA vs control",106,23328941,"MASCOT Score",21.0000000,,,,,,
TIMSNLNLSYPK,ph,S,269,true,"Tissue atlas Arabidopsis - ProteomicsDB",114,32188942,"MaxQuant score",172.0900000,1.0000000,,,,7.5947201747472E-15,
TIMSNLNLSYPK,ph,Y,270,true,"Lateral root-induction - NAA vs control",106,23328941,"MASCOT Score",29.0000000,,,,,,
