Peptide,PTM,ModifiedAA,ModifiedPosition,PeptideUniqueToGene,ExperimentDesc,ExpID,PubmedID,ScoreType,IdentScore,LocProb,Log2FChange,PQ-val,QuantSig,PEP,MassErrorPPM
AASSVGNAEDYAEETATSVKFKR,nt,A,73,true,"N-terminal ChaFRADIC",92,26010716,"MASCOT Score",41.4600000,,,,,1.2570000151868E-8,
AASSVGNAEDYAEETATSVKFKR,nt,A,73,true,"Stromal N-terminome",96,26371235,"MASCOT Score",64.6800000,,,,,,
AASSVGNAEDYAEETATSVKFKR,nt,A,73,true,"HUNTER N-terminome: legumain, GluC and trypsin",119,31951383,"MaxQuant score",122.3000000,,,,,,
AASSVGNAEDYAEE,nt,A,73,true,"N-terminal ChaFRADIC",92,26010716,"MASCOT Score",74.9200000,,,,,3.6960000215913E-7,
AASSVGNAEDYAEE,nt,A,73,true,"HUNTER N-terminome: legumain, GluC and trypsin",119,31951383,"MaxQuant score",148.2800000,,,,,,
AASSVGNAE,nt,A,73,true,"Arg/N-end rule seed, prt6 vs. Wt",99,29168982,"MASCOT Score",42.1700000,,0.1849425,0.4843844,NO,0.0032979999668896,-0.3051636
AASSVGNAEDYAEETATSVKFKR,nta,A,73,true,"N-terminal ChaFRADIC",92,26010716,"MASCOT Score",41.4600000,,,,,1.2570000151868E-8,
AASSVGNAEDYAEETATSVKFKR,nta,A,73,true,"Stromal N-terminome",96,26371235,"MASCOT Score",64.6800000,,,,,,
AASSVGNAEDYAEETATSVKFKR,nta,A,73,true,"FtsH12 N-terminome: WT / FtsH12 knockdown miRNA",118,33216923,"MaxQuant score",69.8120000,,,,,0.024732999503613,
AASSVGNAEDYAEETATSVKFKR,nta,A,73,true,"HUNTER N-terminome: legumain, GluC and trypsin",119,31951383,"MaxQuant score",84.1810000,,,,,,
AASSVGNAEDYAEETATSVKFKR,nta,A,73,true,"Arabidopsis translation initiation landscape - NTA",167a,35069635,,,,,,,,
AASSVGNAEDYAEETATSVK,nta,A,73,true,"Characterization plant N-terminal acetylation",6,22223895,"MASCOT Score",73.0800000,,,,,,
ASSVGNAEDYAEETATSVKFKR,nt,A,74,true,"HUNTER N-terminome: legumain, GluC and trypsin",119,31951383,"MaxQuant score",88.3960000,,,,,,
ASSVGNAEDYAEE,nt,A,74,true,"N-terminal ChaFRADIC",92,26010716,"MASCOT Score",58.9600000,,,,,1.4800000371906E-6,
ASSVGNAEDYAEETATSVKFKR,nta,A,74,true,"HUNTER N-terminome: legumain, GluC and trypsin",119,31951383,"MaxQuant score",44.7290000,,,,,,
SSVGNAEDYAEETATSVKFKR,nt,S,75,true,"HUNTER N-terminome: legumain, GluC and trypsin",119,31951383,"MaxQuant score",62.9660000,,,,,,
SSVGNAEDYAEE,nt,S,75,true,"N-terminal ChaFRADIC",92,26010716,"MASCOT Score",54.6200000,,,,,2.2849999368191E-5,
SVGNAEDYAEE,nt,S,76,true,"N-terminal ChaFRADIC",92,26010716,"MASCOT Score",74.0100000,,,,,6.8679997639265E-5,
