Peptide,PTM,ModifiedAA,ModifiedPosition,PeptideUniqueToGene,ExperimentDesc,ExpID,PubmedID,ScoreType,IdentScore,LocProb,Log2FChange,PQ-val,QuantSig,PEP,MassErrorPPM
QLLPEDEVQTLR,nt,Q,27,false,"HUNTER N-terminome: legumain, GluC and trypsin",119,31951383,"MaxQuant score",154.1500000,,,,,,
KLQNQTVNIER,ng,N,46,false,"N-glycan occupancy Arabidopsis glycoproteins",87,23994444,"Ladder score",50.8000000,,,,,,
KLQNQTVNIER,ng,N,46,false,"N-Glycopeptide Profiling in Arabidopsis Infloresce",132,27067053,"MOWSE score",26.9000000,,,,,0.017000000923872,
KLQNQTVNIER,ng,N,46,false,"N-linked Glycan Micro-heterogeneity Arabidopsis",134,29237727,,,,,,,,
KLQNQTVNIER,ng,N,46,false,"UDP-GlcNAc transporter glycopeptide analysis",135,30224661,,,,,,,6.504511339267E-12,0.5000000
LQNQTVNIER,ng,N,46,false,"Conserved N-glycosylation",74,22633491,"MaxQuant Score",187.6000000,1.0000000,,,,7.3689998792397E-22,-0.0400000
LQNQTVNIER,ng,N,46,false,"N-glycan occupancy Arabidopsis glycoproteins",87,23994444,"Ladder score",71.9000000,,,,,,
LQNQTVNIER,ng,N,46,false,"N-linked Glycan Micro-heterogeneity Arabidopsis",134,29237727,,,,,,,,
LQNQTVNIER,ng,N,46,false,"UDP-GlcNAc transporter glycopeptide analysis",135,30224661,,,,,,,5.2810105463999E-13,0.7000000
TSCLDR,sno,C,56,true,"hot5-4 / wildtype, FAT-switch S-nitrosoproteome",169,37277371,,,,,,,,
LPTSNITCDCTFNASSVCR,ng,N,75,true,"Conserved N-glycosylation",74,22633491,"MaxQuant Score",209.9400000,1.0000000,,,,0,-0.4100000
LPTSNITCDCTFNASSVCR,ng,N,83,true,"Conserved N-glycosylation",74,22633491,"MaxQuant Score",209.9400000,1.0000000,,,,0,-0.4100000
GIIPPEFGNLTR,ng,N,110,true,"Conserved N-glycosylation",74,22633491,"MaxQuant Score",122.1200000,1.0000000,,,,5.3920001796826E-9,-2.1660000
LLISSNNITGR,ng,N,194,true,"Conserved N-glycosylation",74,22633491,"MaxQuant Score",72.4430000,0.8290000,,,,0.0049999998882413,0.4330000
LLISSNNITGR,ng,N,194,true,"UDP-GlcNAc transporter glycopeptide analysis",135,30224661,,,,,,,2.7386012294711E-12,0.0000000
IPESLSNLKNLTNFR,ng,N,208,true,"Conserved N-glycosylation",74,22633491,"MaxQuant Score",85.1940000,0.9930000,,,,0.00017240000306629,-1.6940000
IPDFIGNWTR,ng,N,229,true,"Conserved N-glycosylation",74,22633491,"MaxQuant Score",91.3820000,1.0000000,,,,0.0020000000949949,1.8650000
IPDFIGNWTR,ng,N,229,true,"N-linked Glycan Micro-heterogeneity Arabidopsis",134,29237727,,,,,,,,
IPDFIGNWTR,ng,N,229,true,"UDP-GlcNAc transporter glycopeptide analysis",135,30224661,,,,,,,1.1167317097716E-5,0.4000000
GPTSPFPDLQNMTNMER,ng,N,277,true,"Conserved N-glycosylation",74,22633491,"MaxQuant Score",222.2100000,0.9690000,,,,0,2.0500000
GPTSPFPDLQNMTNMER,ng,N,277,true,"N-linked Glycan Micro-heterogeneity Arabidopsis",134,29237727,,,,,,,,
LLDLSSNMLNGTIPDTFR,ng,N,317,true,"Conserved N-glycosylation",74,22633491,"MaxQuant Score",150.2200000,1.0000000,,,,2.0160000831292E-31,0.6670000
LLDLSSNMLNGTIPDTFR,ng,N,317,true,"N-linked Glycan Micro-heterogeneity Arabidopsis",134,29237727,,,,,,,,
LLDLSSNMLNGTIPDTFR,ng,N,317,true,"UDP-GlcNAc transporter glycopeptide analysis",135,30224661,,,,,,,1.1056224593631E-6,0.4000000
QVDEVQVNGSTLEIHLK,ng,N,559,true,"Conserved N-glycosylation",74,22633491,"MaxQuant Score",240.6700000,1.0000000,,,,0,0.3970000
QVDEVQVNGSTLEIHLK,ng,N,559,true,"N-linked Glycan Micro-heterogeneity Arabidopsis",134,29237727,,,,,,,,
QVDEVQVNGSTLEIHLK,ng,N,559,true,"UDP-GlcNAc transporter glycopeptide analysis",135,30224661,,,,,,,4.3752328837563E-17,0.8000000
GLDLQTGSFTLK,ph,S,654,false,"Tissue atlas Arabidopsis - ProteomicsDB",114,32188942,"MaxQuant score",147.5200000,0.9339080,,,,9.5766097274463E-7,
GLDLQTGSFTLKQIK,ub,K,658,false,"upl3 mutant / wildtype",168,35926874,"MaxQuant score",60.5500000,1.0000000,-0.6688681,,,0.00036343300598674,-0.5561300
LKIVHRDIK,ub,K,788,false,"Ubiquitination Membrane Proteins",120,33585938,,,,,,,,
ISDFGLAKLDEEENTHISTR,ub,K,816,false,"Ubiquitination Membrane Proteins",120,33585938,,,,,,,,
ISDFGLAKLDEEENTHISTR,ub,K,816,false,"upl3 mutant / wildtype",168,35926874,"MaxQuant score",83.6660000,1.0000000,,,,2.0028899143654E-6,1.6244000
LDEEENTHISTR,ph,T,823,false,"atm and atr DNA damage response",88,25561503,"MASCOT Score",69.0000000,0.9480000,,,,,-0.1800000
LDEEENTHISTR,ph,T,823,false,"Tissue atlas Arabidopsis - ProteomicsDB",114,32188942,"MaxQuant score",211.0600000,0.9999990,,,,6.2897999075494E-31,
LDEEENTHISTR,ph,S,826,false,"Large-scale phosphorylation discovery",44,23111157,XCorr,3.0700000,,,,,,
LDEEENTHISTR,ph,S,826,false,"LAXIC - ABA stress",84a,23660473,XCorr,2.6800000,0.9660000,,,,0.23297399282455,
LDEEENTHISTR,ph,S,826,false,"SnRK2 protein kinase substrates",85,23776212,XCorr,3.0645318,0.9280000,,,,0.021057400852442,
LDEEENTHISTR,ph,S,826,false,"atm and atr DNA damage response",88,25561503,"MASCOT Score",96.0000000,0.9520000,,,,,-0.4700000
LDEEENTHISTR,ph,S,826,false,"Protein sumoylation and phosphorylation cross-talk",97,28419593,,,,,,,,
LDEEENTHISTR,ph,S,826,false,"TOR Kinase and ABA Receptor",100,29290610,XCorr,3.8139112,0.8855000,,,,0.00013669999316335,
LDEEENTHISTR,ph,S,826,false,"Tissue atlas Arabidopsis - ProteomicsDB",114,32188942,"MaxQuant score",305.5800000,0.9960390,,,,0,
LDEEENTHISTR,ph,S,826,false,"Touch-induced phosphorylation: 40s touch vs untouc",136,30291188,"MASCOT score",89.4700000,,0.0082374,0.9578044,NO,,10.5745143
LDEEENTHISTR,ph,T,827,false,"Large-scale phosphorylation discovery",44,23111157,XCorr,3.6210000,,,,,,
EADPSGSAAMR,ph,S,956,false,"atm and atr DNA damage response",88,25561503,"MASCOT Score",46.0000000,0.9910000,,,,,-0.2300000
ALEHLSQDSESQVSTYTR,ph,S,973,true,"Tissue atlas Arabidopsis - ProteomicsDB",114,32188942,"MaxQuant score",80.2380000,0.9261400,,,,0.00011127100151498,
ALEHLSQDSESQVSTYTR,ph,S,975,true,"Tissue atlas Arabidopsis - ProteomicsDB",114,32188942,"MaxQuant score",105.2200000,0.9988200,,,,1.2588000686264E-7,
SSSSMDGPWVDSSFSDPSK,ph,S,990,true,"Tissue atlas Arabidopsis - ProteomicsDB",114,32188942,"MaxQuant score",235.9500000,0.9671900,,,,0,
SSSSMDGPWVDSSFSDPSK,ph,S,991,true,"atm and atr DNA damage response",88,25561503,"MASCOT Score",33.0000000,0.8920000,,,,,0.0000000
SSSSMDGPWVDSSFSDPSK,ph,S,991,true,"Tissue atlas Arabidopsis - ProteomicsDB",114,32188942,"MaxQuant score",154.4900000,0.8737550,,,,1.8894899900404E-22,
SSSSMDGPWVDSSFSDPSK,ph,S,999,true,"Tissue atlas Arabidopsis - ProteomicsDB",114,32188942,"MaxQuant score",142.9400000,0.7648290,,,,3.925819866692E-18,
SSSSMDGPWVDSSFSDPSK,ph,S,1000,true,"Tissue atlas Arabidopsis - ProteomicsDB",114,32188942,"MaxQuant score",176.1100000,0.9366160,,,,2.0334200066287E-29,
DVSLLQQEEGNSSSSSRR,ph,S,1018,true,"atm and atr DNA damage response",88,25561503,"MASCOT Score",32.0000000,0.8480000,,,,,-0.5200000
DVSLLQQEEGNSSSSSR,ph,S,1018,true,"atm and atr DNA damage response",88,25561503,"MASCOT Score",27.0000000,0.9900000,,,,,-0.3200000
DVSLLQQEEGNSSSSSR,ph,S,1018,true,"Tissue atlas Arabidopsis - ProteomicsDB",114,32188942,"MaxQuant score",222.1100000,0.7859790,,,,0,
DVSLLQQEEGNSSSSSRR,ph,S,1019,true,"atm and atr DNA damage response",88,25561503,"MASCOT Score",32.0000000,0.8480000,,,,,-0.5200000
DVSLLQQEEGNSSSSSR,ph,S,1019,true,"atm and atr DNA damage response",88,25561503,"MASCOT Score",31.0000000,0.9970000,,,,,-0.4900000
DVSLLQQEEGNSSSSSR,ph,S,1019,true,"Tissue atlas Arabidopsis - ProteomicsDB",114,32188942,"MaxQuant score",319.6700000,0.8442100,,,,0,
DVSLLQQEEGNSSSSSRR,ph,S,1020,true,"atm and atr DNA damage response",88,25561503,"MASCOT Score",35.0000000,1.0000000,,,,,0.5700000
DVSLLQQEEGNSSSSSR,ph,S,1020,true,"atm and atr DNA damage response",88,25561503,"MASCOT Score",71.0000000,0.9530000,,,,,0.1900000
DVSLLQQEEGNSSSSSRR,ph,S,1021,true,"atm and atr DNA damage response",88,25561503,"MASCOT Score",35.0000000,1.0000000,,,,,0.5700000
DVSLLQQEEGNSSSSSRR,ph,S,1022,true,"atm and atr DNA damage response",88,25561503,"MASCOT Score",47.0000000,0.8580000,,,,,0.0700000
RLLDDLTDVEIE,ph,T,1030,true,"Chloroplast kinase substrates",60,19376835,"MASCOT Score",36.6000000,,,,,,-0.6326490
RLLDDLTDVEIE,ph,T,1030,true,"atm and atr DNA damage response",88,25561503,"MASCOT Score",39.0000000,1.0000000,,,,,0.5500000
RLLDDLTDVEIE,ph,T,1030,true,"Tissue atlas Arabidopsis - ProteomicsDB",114,32188942,"MaxQuant score",153.8100000,1.0000000,,,,1.1879200201292E-7,
RLLDDLTDVEIE,ph,T,1030,true,"Touch-induced phosphorylation: 40s touch vs untouc",136,30291188,"MASCOT score",63.0400000,,-0.0594852,0.7084524,NO,,11.0156434
LLDDLTDVEIE,ph,T,1030,true,"atm and atr DNA damage response",88,25561503,"MASCOT Score",36.0000000,1.0000000,,,,,-0.6700000
LLDDLTDVEIE,ph,T,1030,true,"TOR Kinase and ABA Receptor",100,29290610,XCorr,3.9804635,1.0000000,,,,7.2249997174367E-5,
LLDDLTDVEIE,ph,T,1030,true,"Touch-induced phosphorylation: 40s touch vs untouc",136,30291188,"MASCOT score",54.6600000,,-0.1353568,0.0774431,NO,,6.1246582
