Peptide,PTM,ModifiedAA,ModifiedPosition,PeptideUniqueToGene,ExperimentDesc,ExpID,PubmedID,ScoreType,IdentScore,LocProb,Log2FChange,PQ-val,QuantSig,PEP,MassErrorPPM
QLLPEDEVQTLR,nt,Q,29,false,"HUNTER N-terminome: legumain, GluC and trypsin",119,31951383,"MaxQuant score",154.1500000,,,,,,
KLQNQTVNIER,ng,N,48,false,"N-glycan occupancy Arabidopsis glycoproteins",87,23994444,"Ladder score",50.8000000,,,,,,
KLQNQTVNIER,ng,N,48,false,"N-Glycopeptide Profiling in Arabidopsis Infloresce",132,27067053,"MOWSE score",26.9000000,,,,,0.017000000923872,
KLQNQTVNIER,ng,N,48,false,"N-linked Glycan Micro-heterogeneity Arabidopsis",134,29237727,,,,,,,,
KLQNQTVNIER,ng,N,48,false,"UDP-GlcNAc transporter glycopeptide analysis",135,30224661,,,,,,,6.504511339267E-12,0.5000000
LQNQTVNIER,ng,N,48,false,"Conserved N-glycosylation",74,22633491,"MaxQuant Score",187.6000000,1.0000000,,,,7.3689998792397E-22,-0.0400000
LQNQTVNIER,ng,N,48,false,"N-glycan occupancy Arabidopsis glycoproteins",87,23994444,"Ladder score",71.9000000,,,,,,
LQNQTVNIER,ng,N,48,false,"N-linked Glycan Micro-heterogeneity Arabidopsis",134,29237727,,,,,,,,
LQNQTVNIER,ng,N,48,false,"UDP-GlcNAc transporter glycopeptide analysis",135,30224661,,,,,,,5.2810105463999E-13,0.7000000
SFSLPGIFPPEFGNLTR,ng,N,112,true,"UDP-GlcNAc transporter glycopeptide analysis",135,30224661,,,,,,,5.7395897812285E-8,0.6000000
ELLLSANNFTGQIPESLSNLK,ng,N,196,true,"UDP-GlcNAc transporter glycopeptide analysis",135,30224661,,,,,,,6.0262150562078E-15,0.9000000
LDLQGTSMEGPIPPSISNLTNLTELR,ng,N,255,true,"Conserved N-glycosylation",74,22633491,"MaxQuant Score",179.6400000,1.0000000,,,,0,0.6530000
LDLQGTSMEGPIPPSISNLTNLTELR,ng,N,258,true,"Conserved N-glycosylation",74,22633491,"MaxQuant Score",179.6400000,1.0000000,,,,0,0.6530000
EDAGYLATDRFNLINGSTPEYYK,ng,N,471,true,"UDP-GlcNAc transporter glycopeptide analysis",135,30224661,,,,,,,6.867636833703E-15,0.3000000
FNLINGSTPEYYK,ng,N,471,true,"Conserved N-glycosylation",74,22633491,"MaxQuant Score",231.4600000,1.0000000,,,,0,0.7560000
FNLINGSTPEYYK,ng,N,471,true,"N-linked Glycan Micro-heterogeneity Arabidopsis",134,29237727,,,,,,,,
FNLINGSTPEYYK,ng,N,471,true,"UDP-GlcNAc transporter glycopeptide analysis",135,30224661,,,,,,,3.0176588902394E-14,0.6000000
GLDLQTGSFTLK,ph,S,656,false,"Tissue atlas Arabidopsis - ProteomicsDB",114,32188942,"MaxQuant score",147.5200000,0.9339080,,,,9.5766097274463E-7,
GLDLQTGSFTLKQIK,ub,K,660,false,"upl3 mutant / wildtype",168,35926874,"MaxQuant score",60.5500000,1.0000000,-0.6688681,,,0.00036343300598674,-0.5561300
LKIVHRDIK,ub,K,790,false,"Ubiquitination Membrane Proteins",120,33585938,,,,,,,,
LNDDENTHISTR,ph,S,828,true,"STN8 phosphoproteome",38,21768351,"MASCOT Score",53.7300000,,,,,,-0.6829110
LNDDENTHISTR,ph,S,828,true,"Chloroplast kinase substrates",60,19376835,"MASCOT Score",40.8800000,,,,,,-1.0573400
LNDDENTHISTR,ph,S,828,true,"atm and atr DNA damage response",88,25561503,"MASCOT Score",68.0000000,0.9960000,,,,,0.6700000
LNDDENTHISTR,ph,S,828,true,"TOR Kinase and ABA Receptor",100,29290610,XCorr,3.6860890,0.9902000,,,,2.6019999950222E-6,
LNDDENTHISTR,ph,S,828,true,"Lateral root-induction - NAA vs control",106,23328941,"MASCOT Score",49.0000000,,,,,,
LNDDENTHISTR,ph,S,828,true,"Tissue atlas Arabidopsis - ProteomicsDB",114,32188942,"MaxQuant score",273.8400000,0.9944610,,,,0,
LNDDENTHISTR,ph,T,829,true,"atm and atr DNA damage response",88,25561503,"MASCOT Score",71.0000000,0.9410000,,,,,-0.2200000
EADPSGSAAMR,ph,S,958,false,"atm and atr DNA damage response",88,25561503,"MASCOT Score",46.0000000,0.9910000,,,,,-0.2300000
ALELLSQDSESQVSTYAR,ph,S,977,true,"TOR Kinase and ABA Receptor",100,29290610,XCorr,3.8269811,0.9082000,,,,0.00020890000450891,
ALELLSQDSESQVSTYAR,ph,S,977,true,"Tissue atlas Arabidopsis - ProteomicsDB",114,32188942,"MaxQuant score",164.5300000,0.9742750,,,,3.4634500068154E-22,
EQDISSSSMDGPWVDSSFSEPGK,ph,S,1003,true,"Tissue atlas Arabidopsis - ProteomicsDB",114,32188942,"MaxQuant score",229.7800000,0.9161540,,,,0,
DVSLQQQEEGR,ph,S,1012,true,"Tissue atlas Arabidopsis - ProteomicsDB",114,32188942,"MaxQuant score",137.9500000,1.0000000,,,,1.4632599913966E-6,
DVSLQQQEEGRSSSSSR,ph,S,1021,true,"atm and atr DNA damage response",88,25561503,"MASCOT Score",41.0000000,0.8710000,,,,,-0.2700000
DVSLQQQEEGRSSSSSR,ph,S,1022,true,"atm and atr DNA damage response",88,25561503,"MASCOT Score",41.0000000,0.8710000,,,,,-0.2700000
DVSLQQQEEGRSSSSSR,ph,S,1025,true,"TOR Kinase and ABA Receptor",100,29290610,XCorr,2.5590456,0.8109000,,,,0.0072949999012053,
