Peptide,PTM,ModifiedAA,ModifiedPosition,PeptideUniqueToGene,ExperimentDesc,ExpID,PubmedID,ScoreType,IdentScore,LocProb,Log2FChange,PQ-val,QuantSig,PEP,MassErrorPPM
SLSNSTAALNR,ng,N,74,true,"Conserved N-glycosylation",74,22633491,"MaxQuant Score",139.8900000,1.0000000,,,,6.3389999629612E-13,-0.1200000
KTQSQIFK,ph,S,462,true,"atm and atr DNA damage response",88,25561503,"MASCOT Score",28.0000000,1.0000000,,,,,-1.4400000
TQSQIFK,ph,S,462,false,"STN8 phosphoproteome",38,21768351,"MASCOT Score",43.7000000,,,,,,0.5712110
TQSQIFK,ph,S,462,false,"TOR Kinase and ABA Receptor",100,29290610,XCorr,2.9165444,0.9961000,,,,0.011620000004768,
TQSQIFK,ph,S,462,false,"Tissue atlas Arabidopsis - ProteomicsDB",114,32188942,"MaxQuant score",211.8400000,1.0000000,,,,5.9397101224035E-15,
KTQSQIFKYAYDR,ub,K,466,true,"Protein ubiquitination during photomorphogenesis",3,28461270,,,,,,,,
NLTFSGIVK,ph,S,488,true,"Tissue atlas Arabidopsis - ProteomicsDB",114,32188942,"MaxQuant score",120.0600000,0.9999990,,,,0.00028959699557163,
SNGKQVLRCVTGSMKPGR,ub,K,521,true,"Protein ubiquitination during photomorphogenesis",3,28461270,,,,,,,,
