Peptide,PTM,ModifiedAA,ModifiedPosition,PeptideUniqueToGene,ExperimentDesc,ExpID,PubmedID,ScoreType,IdentScore,LocProb,Log2FChange,PQ-val,QuantSig,PEP,MassErrorPPM
TMSSSTKKVLIPVAHGTEPFEAVVMI,nt,T,47,true,"Arabidopsis translation initiation landscape - NT",167b,35069635,,,,,,,,
SSSTKKVLIPVAHGTEPFEAVVMIDVLR,nta,S,49,true,"Arg/N-end rule pathway Roots",80,25728785,"MASCOT Score",64.5800000,,,,,0.00030839999089949,
SSSTKKVLIPVAHGTEPFEAVVMI,nta,S,49,true,"Arabidopsis translation initiation landscape - NTA",167a,35069635,,,,,,,,
GGADVTVASVENQVGVDACHGIK,sno,C,96,true,"Site-specific nitrosomeproteomic id - gsnor1-3",90b,25699590,XCorr,3.0600000,,,,,0.0013920000055805,-6.8900000
GGADVTVASVENQVGVDACHGIK,sno,C,96,true,"hot5-4 / wildtype, FAT-switch S-nitrosoproteome",169,37277371,,,,0.7111079,0.0006888,YES,,
GGADVTVASVENQVGVDACHGIK,so,C,96,true,"Arabidopsis S-sulfenylation chemoproteomics",108,31578252,"pFind PSM Score",0.0000358,,1.4525800,,,,-0.9270891
NCKPLEK,sno,C,133,true,"hot5-4 / wildtype, FAT-switch S-nitrosoproteome",169,37277371,,,,,,,,
ATCYPVFMEK,ox,C,174,true,"SPEAR - 50 mM H2O2 / mock",138b,34619326,,,,2.9918444,0.0064367,YES,,
ATCYPVFMEK,sno,C,174,true,"Site-specific nitrosomeproteomic id - gsnor1-3",90a,25699590,XCorr,3.1831427,,,,,0.00060269999084994,-6.5425548
ATCYPVFMEK,sno,C,174,true,"Site-specific nitrosomeproteomic id - gsnor1-3",90b,25699590,XCorr,2.6263649,,,,,0.16480000317097,-6.9147838
ATCYPVFMEK,sno,C,174,true,"hot5-4 / wildtype, FAT-switch S-nitrosoproteome",169,37277371,,,,0.7995663,0.0012023,YES,,
LAACATAVESR,ox,C,185,true,"OxiTRAQ Arabidopsis - 5 mM H2O2 versus control",47,24376095,,,,0.2338757,0.0807089,NO,,
LAACATAVESR,sno,C,185,true,"hot5-4 / wildtype, FAT-switch S-nitrosoproteome",169,37277371,,,,0.5520449,0.0061547,NO,,
LVNMLK,mox,M,344,true,"cat2 Methionine oxidation - 1h stress",62a,25693801,"MASCOT Score",33.0000000,,-0.5148155,,NO,,
ATAFPAMCSK,ox,C,384,true,"OxiTRAQ Arabidopsis - 5 mM H2O2 versus control",47,24376095,,,,0.0406070,0.4384117,NO,,
