Peptide,PTM,ModifiedAA,ModifiedPosition,PeptideUniqueToGene,ExperimentDesc,ExpID,PubmedID,ScoreType,IdentScore,LocProb,Log2FChange,PQ-val,QuantSig,PEP,MassErrorPPM
SFSSGSVPER,nt,S,21,true,"Mitochondrial intermediate peptidases - oct1-2 / WT",131c,25732537,,60.4100000,,1.4362739,,,,
FSSGSVPER,nt,F,22,true,"Mitochondrial intermediate peptidases - icp55 / WT",131a,25732537,,44.7200000,,6.6438562,,,,
SSGSVPERKVAILGAAGGIGQPL,nt,S,23,true,"Arabidopsis translation initiation landscape - NT",167b,35069635,,,,,,,,
SSGSVPERK,nt,S,23,true,"N-terminal ChaFRADIC",92,26010716,"MASCOT Score",33.3700000,,,,,0.010049999691546,
SSGSVPER,nt,S,23,true,"N-terminal ChaFRADIC",92,26010716,"MASCOT Score",42.8300000,,,,,0.0005086999735795,
SSGSVPER,nt,S,23,true,"Arg/N-end rule seed, prt6 vs. Wt",99,29168982,"MASCOT Score",30.2900000,,-0.0880142,0.3019587,NO,0.13879999518394,-0.7806423
SFSSGSVPERK,ph,S,23,true,"TOR Kinase and ABA Receptor",100,29290610,XCorr,2.7401409,0.9993000,,,,0.022439999505877,
SFSSGSVPERK,ph,S,23,true,"Phospho cell culture sucrose/TOR",109,30833711,,,0.9993440,,,,,
SFSSGSVPERK,ph,S,23,true,"Tissue atlas Arabidopsis - ProteomicsDB",114,32188942,"MaxQuant score",124.3900000,0.9888760,,,,1.3569199836638E-5,
SFSSGSVPER,ph,S,23,true,"Tyrosine phosphorylation in Arabidopsis",59,18463617,"MASCOT Score",51.0000000,,,,,,-0.9721964
SFSSGSVPER,ph,S,23,true,"Chloroplast kinase substrates",60,19376835,"MASCOT Score",32.7500000,,,,,,-0.5111560
SFSSGSVPER,ph,S,23,true,"Conserved plant phosphoproteome - Arabidopsis",61a,20466843,"MASCOT Score",51.0000000,1.0000000,,,,,
SFSSGSVPER,ph,S,23,true,"atm and atr DNA damage response",88,25561503,"MASCOT Score",42.0000000,1.0000000,,,,,-0.3000000
SFSSGSVPER,ph,S,24,true,"Tyrosine phosphorylation in Arabidopsis",59,18463617,"MASCOT Score",34.0000000,,,,,,-0.3535257
SFSSGSVPER,ph,S,24,true,"Tissue atlas Arabidopsis - ProteomicsDB",114,32188942,"MaxQuant score",103.2100000,0.7641680,,,,0.00034292798954993,
MKLNPLVSSLSLYD,nt,M,49,false,"Arabidopsis translation initiation landscape - NT",167b,35069635,,,,,,,,
SLYDIANTPGVAADVGHINTR,nt,S,59,false,"Arg/N-end rule seed, prt6 vs. Wt",99,29168982,"MASCOT Score",65.9000000,,,,,1.0280000424245E-6,-2.1096261
SLYDIANTPGVAADVGHINTR,nta,S,59,false,"FtsH12 N-terminome: WT / FtsH12 knockdown miRNA",118,33216923,"MaxQuant score",70.1510000,,,,,8.2800001766782E-18,
DIANTPGVAADVGHINTR,nt,D,62,false,"FtsH12 N-terminome: WT / FtsH12 knockdown miRNA",118,33216923,"MaxQuant score",140.0700000,,,,,0,
NTPGVAADVGHINTR,nta,N,65,false,"FtsH12 N-terminome: WT / FtsH12 knockdown miRNA",118,33216923,"MaxQuant score",84.3520000,,,,,0.00024389999452978,
TPGVAADVGHINTR,nt,T,66,false,"Arg/N-end rule pathway Roots",80,25728785,"MASCOT Score",32.9600000,,,,,0.0071950000710785,
SEVVGYMGDDNLAKALEGADLVIIPAGVPR,nt,S,80,true,"N-terminal ChaFRADIC",92,26010716,"MASCOT Score",66.5300000,,,,,1.0870000239542E-13,
SEVVGYMGDDNLAKALEGADLVIIPAGVPR,nt,S,80,true,"Arabidopsis translation initiation landscape - NT",167b,35069635,,,,,,,,
GDDNLAKALEGADLVIIPAGVPR,nt,G,87,true,"Arg/N-end rule pathway Roots",80,25728785,"MASCOT Score",36.5300000,,,,,0.0036989999935031,
SEVVGYMGDDNLAKALEGADLVIIPAGVPR,ub,K,93,true,"Arabidopsis ubiquitination COFRADIC",40,26744219,"MaxQuant Score",48.1800000,1.0000000,,,,0.003000000026077,2.0310000
NLCTAIAK,ox,C,130,true,"OxiTRAQ Arabidopsis - 5 mM H2O2 versus control",47,24376095,,,,0.3216875,0.0453547,NO,,
NLCTAIAK,ox,C,130,true,"Redox kickstart of mitochondria",112,31871212,,,,-2.0376747,0.0022979,YES,,
NLCTAIAK,sno,C,130,true,"hot5-4 / wildtype, FAT-switch S-nitrosoproteome",169,37277371,,,,-0.1414242,0.4544396,NO,,
NLCTAIAK,so,C,130,true,"S-sulfenylation site detection using YAP1C",110,32714340,,,,,,,,
AGMYDEK,mox,M,165,true,"cat2 Methionine oxidation - 3h stress",62b,25693801,"MASCOT Score",31.0000000,,-0.3678630,,NO,,
AGMYDEKK,ac,K,169,true,"Quantitative Acetylproteomics",101,29440448,,,,,,,,
KLFGVTTLDVVR,cr,K,170,false,"Open search Plant PTM Viewer 2.0 - Crotonylation",164c,TBA,,,,,,,,
GVTTLDVVR,nt,G,173,false,"Arabidopsis translation initiation landscape - NT",167b,35069635,,,,,,,,
VTTLDVVR,nt,V,174,false,"Arg/N-end rule seed, prt6 vs. Wt",99,29168982,"MASCOT Score",40.3100000,,,,,0.076310001313686,-1.0824135
SQATPQANLSSDILTALTKR,nt,S,215,true,"Arabidopsis translation initiation landscape - NT",167b,35069635,,,,,,,,
AGKGSATLSMAYAGALFADACLK,me2,K,249,false,"Arabidopsis protein methylome",123,31809900,"MaxQuant Score",75.5390000,1.0000000,,,,7.2816699336897E-9,1.6980000
AGKGSATLSMAYAGALFADACLK,me3,K,249,false,"Arabidopsis protein methylome",123,31809900,"MaxQuant Score",83.8260000,1.0000000,,,,1.5690200176497E-38,-0.1606800
GSATLSMAYAGALFADACLK,ox,C,267,false,"Redox kickstart of mitochondria",112,31871212,,,,-0.9318401,0.0196971,YES,,
LKGLNGVPDVIE,nt,L,268,true,"Arg/N-end rule seed, prt6 vs. Wt",99,29168982,"MASCOT Score",22.9600000,,-0.3864807,0.0344592,NO,0.00080069998512045,-1.1720772
GLNGVPDVIECSYVQSTITELPFFASK,so,C,280,true,"S-sulfenylation site detection using YAP1C",110,32714340,,,,,,,,
YVQSTITE,nt,Y,282,true,"Arg/N-end rule seed, prt6 vs. Wt",99,29168982,"MASCOT Score",46.3200000,,-0.0990086,0.0515634,NO,0.024340000003576,-1.0296763
NGVEEVLDLGPLSDFEK,ph,S,314,false,"Tyrosine phosphorylation in Arabidopsis",59,18463617,"MASCOT Score",26.0000000,,,,,,-0.5670453
EGLEALKPELKSSIEK,ac,K,329,true,"Quantitative Acetylproteomics",101,29440448,,,,,,,,
EGLEALKPELKSSIEK,cr,K,329,true,"Open search Plant PTM Viewer 2.0 - Crotonylation",164c,TBA,,,,,,,,
SSIEKGVKFANQ,nt,S,330,true,"Arabidopsis translation initiation landscape - NT",167b,35069635,,,,,,,,
