Peptide,PTM,ModifiedAA,ModifiedPosition,PeptideUniqueToGene,ExperimentDesc,ExpID,PubmedID,ScoreType,IdentScore,LocProb,Log2FChange,PQ-val,QuantSig,PEP,MassErrorPPM
EEACEQTYGFMPCTK,sno,C,75,true,"hot5-4 / wildtype, FAT-switch S-nitrosoproteome",169,37277371,,,,,,,,
CDLRDSIAVNNQDTK,ph,S,182,true,"Tissue atlas Arabidopsis - ProteomicsDB",114,32188942,"MaxQuant score",194.1000000,1.0000000,,,,5.8824001060128E-34,
LAFAKHK,ac,K,272,true,"Quantitative Acetylproteomics",101,29440448,,,,,,,,
HVISGILR,ph,S,278,true,"Tissue atlas Arabidopsis - ProteomicsDB",114,32188942,"MaxQuant score",96.3420000,1.0000000,,,,0.0057327002286911,
DEGQPDEHVIR,nt,D,295,true,"Arg/N-end rule seed, prt6 vs. Wt",99,29168982,"MASCOT Score",50.2900000,,,,,0.0049459999427199,-0.2882055
VLQDFDKTLDEQVDQEEFVR,ub,K,353,true,"upl3 mutant / wildtype",168,35926874,"MaxQuant score",174.2000000,1.0000000,0.7857598,0.0576190,NO,1.6745099590576E-26,-0.5182800
QWLIQAMGGAPSGPEAGPR,ph,S,381,true,"TOR Kinase and ABA Receptor",100,29290610,XCorr,3.6146431,1.0000000,,,,0.00027650000993162,
QWLIQAMGGAPSGPEAGPR,ph,S,381,true,"Tissue atlas Arabidopsis - ProteomicsDB",114,32188942,"MaxQuant score",233.6300000,1.0000000,,,,0,
QWLIQAMGGAPSGPEAGPRTMK,ph,T,389,true,"TOR Kinase and ABA Receptor",100,29290610,XCorr,5.8038263,0.9976000,,,,2.9759999051748E-6,
QWLIQAMGGAPSGPEAGPRTMK,ph,T,389,true,"Phospho cell culture sucrose/TOR",109,30833711,,,0.7705580,,,,,
TMKFLDNFHVQTK,ph,T,389,true,"Tissue atlas Arabidopsis - ProteomicsDB",114,32188942,"MaxQuant score",206.9200000,1.0000000,,,,0,
TMKFLDNFHVQTK,ub,K,391,true,"upl3 mutant / wildtype",168,35926874,"MaxQuant score",98.9420000,1.0000000,-1.8730271,,,1.6060299458331E-5,-0.8468900
FLDNFHVQTKR,ph,T,400,true,"atm and atr DNA damage response",88,25561503,"MASCOT Score",35.0000000,1.0000000,,,,,1.1500000
FLDNFHVQTKR,ph,T,400,true,"Tissue atlas Arabidopsis - ProteomicsDB",114,32188942,"MaxQuant score",115.8200000,1.0000000,,,,7.4189301813021E-6,
FLDNFHVQTKR,ac,K,401,true,"Quantitative Acetylproteomics",101,29440448,,,,,,,,
FLDNFHVQTKR,ub,K,401,true,"Ubiquitination Membrane Proteins",120,33585938,,,,,,,,
FLDNFHVQTKR,ub,K,401,true,"upl3 mutant / wildtype",168,35926874,"MaxQuant score",128.0100000,1.0000000,-0.2898273,,,1.225500000146E-6,-1.9966000
