Peptide,PTM,ModifiedAA,ModifiedPosition,PeptideUniqueToGene,ExperimentDesc,ExpID,PubmedID,ScoreType,IdentScore,LocProb,Log2FChange,PQ-val,QuantSig,PEP,MassErrorPPM
AATMPEMNGR,ph,T,108,true,"atm and atr DNA damage response",88,25561503,"MASCOT Score",46.0000000,1.0000000,,,,,0.4300000
AATMPEMNGR,ph,T,108,true,"TOR Kinase and ABA Receptor",100,29290610,XCorr,2.6702001,1.0000000,,,,0.00052040000446141,
AATMPEMNGR,ph,T,108,true,"Tissue atlas Arabidopsis - ProteomicsDB",114,32188942,"MaxQuant score",113.6900000,1.0000000,,,,0.00053735199617222,
SGGGHAGSGLNGIEEDGALDNDDDDDDDDDDSEMENRDR,ph,S,147,true,"TOR Kinase and ABA Receptor",100,29290610,XCorr,5.6077447,1.0000000,,,,4.7419998736586E-5,
AKAAVSHLHTR,ub,K,460,true,"Ubiquitination Membrane Proteins",120,33585938,,,,,,,,
VSSPPRVPNPAIQK,ph,S,593,true,"STN8 phosphoproteome",38,21768351,"MASCOT Score",51.2200000,,,,,,0.8601990
VSSPPRVPNPAIQK,ph,S,593,true,"Phosphoproteome ethylene-regulated time response",46,24043427,"MASCOT Score",47.9700000,,,,,,-10.3438000
VSSPPRVPNPAIQK,ph,S,593,true,"Tyrosine phosphorylation in Arabidopsis",59,18463617,"MASCOT Score",21.0000000,,,,,,-1.4023409
VSSPPRVPNPAIQK,ph,S,593,true,"atm and atr DNA damage response",88,25561503,"MASCOT Score",30.0000000,0.9510000,,,,,0.4300000
VSSPPRVPNPAIQK,ph,S,593,true,"Phospho cell culture sucrose/TOR",109,30833711,,,0.9998920,,,,,
VSSPPRVPNPAIQK,ph,S,593,true,"Col-0 callus - FC Col-0 vs. Col-0 Xray",111a,31410901,,20.7800000,,0.0272752,0.0000000,NO,,-0.1004488
VSSPPRVPNPAIQK,ph,S,593,true,"Col-0 X-ray callus - FC Col-0 vs. Col-0 Xray",111b,31410901,,20.7800000,,0.0272752,0.0000000,NO,,-0.1004488
VSSPPRVPNPAIQK,ph,S,593,true,"atm callus - FC atm vs. atm Xray",111c,31410901,,20.7800000,,-0.1520471,0.0000000,NO,,-0.1004488
VSSPPRVPNPAIQK,ph,S,593,true,"atm-3 X-ray callus - FC atm vs. atm Xray",111d,31410901,,20.7800000,,-0.1520471,0.0000000,NO,,-0.1004488
VSSPPRVPNPAIQK,ph,S,593,true,"Tissue atlas Arabidopsis - ProteomicsDB",114,32188942,"MaxQuant score",193.9800000,0.9999770,,,,2.8289700953669E-31,
QFNVEQIKK,ub,K,703,true,"Ubiquitination Membrane Proteins",120,33585938,,,,,,,,
QFNVEQIKK,ub,K,703,true,"upl3 mutant / wildtype",168,35926874,"MaxQuant score",89.6980000,1.0000000,0.2461040,0.7442000,NO,0.00170031003654,-0.2739000
HQKPSQGQSS,ph,S,775,true,"atm and atr DNA damage response",88,25561503,"MASCOT Score",25.0000000,0.9490000,,,,,1.9600000
