Peptide,PTM,ModifiedAA,ModifiedPosition,PeptideUniqueToGene,ExperimentDesc,ExpID,PubmedID,ScoreType,IdentScore,LocProb,Log2FChange,PQ-val,QuantSig,PEP,MassErrorPPM
ETSALQIK,ph,S,186,true,"atm and atr DNA damage response",88,25561503,"MASCOT Score",32.0000000,0.9520000,,,,,-0.5300000
ETSALQIK,ph,S,186,true,"Tissue atlas Arabidopsis - ProteomicsDB",114,32188942,"MaxQuant score",93.5980000,0.9949840,,,,0.0062107797712088,
SFMDEHSDDESVLSESWR,ph,S,214,true,"Tissue atlas Arabidopsis - ProteomicsDB",114,32188942,"MaxQuant score",110.2200000,0.9982470,,,,4.6590797886381E-10,
ILPYGIISSPDTK,ph,S,265,true,"Tissue atlas Arabidopsis - ProteomicsDB",114,32188942,"MaxQuant score",97.6900000,0.7665300,,,,0.00024063799355645,
ILPYGIISSPDTK,ph,S,266,true,"atm and atr DNA damage response",88,25561503,"MASCOT Score",40.0000000,0.9510000,,,,,1.0100000
ILPYGIISSPDTK,ph,S,266,true,"Tissue atlas Arabidopsis - ProteomicsDB",114,32188942,"MaxQuant score",179.9400000,0.9535770,,,,9.8179400520611E-23,
LLGIQGSR,ph,S,303,true,"Tissue atlas Arabidopsis - ProteomicsDB",114,32188942,"MaxQuant score",73.8850000,1.0000000,,,,0.011628800071776,
SLTSTSNNEVSTIR,ph,S,305,true,"atm and atr DNA damage response",88,25561503,"MASCOT Score",62.0000000,1.0000000,,,,,-0.3500000
SLTSTSNNEVSTIR,ph,S,305,true,"Tissue atlas Arabidopsis - ProteomicsDB",114,32188942,"MaxQuant score",198.8100000,0.9986030,,,,5.2634898957786E-32,
SLTSTSNNEVSTIR,ph,T,307,true,"Tissue atlas Arabidopsis - ProteomicsDB",114,32188942,"MaxQuant score",117.0800000,0.9963610,,,,0.00012576900189742,
SLTSTSNNEVSTIR,ph,S,310,true,"Tissue atlas Arabidopsis - ProteomicsDB",114,32188942,"MaxQuant score",84.1950000,0.8675380,,,,0.00027124100597575,
MSSFQRPNLLDYDDVVAR,ph,S,325,true,"TOR Kinase and ABA Receptor",100,29290610,XCorr,3.9088190,0.9166000,,,,3.2660000215401E-6,
MSSFQRPNLLDYDDVVAR,ph,S,325,true,"Tissue atlas Arabidopsis - ProteomicsDB",114,32188942,"MaxQuant score",79.2370000,0.9751810,,,,6.1728300352115E-5,
