Peptide,PTM,ModifiedAA,ModifiedPosition,PeptideUniqueToGene,ExperimentDesc,ExpID,PubmedID,ScoreType,IdentScore,LocProb,Log2FChange,PQ-val,QuantSig,PEP,MassErrorPPM
SWSSDCAMR,ph,S,35,true,"Tissue atlas Arabidopsis - ProteomicsDB",114,32188942,"MaxQuant score",119.2200000,0.9998140,,,,0.00030332698952407,
CGSVDRPSLPIGGVTPNR,ph,S,72,true,"Tissue atlas Arabidopsis - ProteomicsDB",114,32188942,"MaxQuant score",116.8200000,0.9821390,,,,7.4896300272798E-10,
CGSVDRPSLPIGGVTPNRNDK,ph,T,79,true,"Tissue atlas Arabidopsis - ProteomicsDB",114,32188942,"MaxQuant score",157.4900000,1.0000000,,,,9.3686100553747E-22,
TDLLCNIPALK,sno,C,206,true,"Site-specific nitrosomeproteomic id - gsnor1-3",90a,25699590,XCorr,2.4600000,,,,,0.050489999353886,-6.7000000
TDLLCNIPALK,sno,C,206,true,"Site-specific nitrosomeproteomic id - gsnor1-3",90b,25699590,XCorr,2.4400000,,,,,0.14229999482632,-7.0700000
TDLLCNIPALK,so,C,206,true,"S-sulfenylation site detection using YAP1C",110,32714340,,,,,,,,
DTKSPWGSTVSIEK,ph,S,368,true,"Tissue atlas Arabidopsis - ProteomicsDB",114,32188942,"MaxQuant score",191.4000000,0.9999890,,,,3.8156099939838E-31,
SPWGSTVSIEK,ph,S,372,true,"Tissue atlas Arabidopsis - ProteomicsDB",114,32188942,"MaxQuant score",233.7000000,0.9873500,,,,2.135578859631E-42,
NRYSLKENEK,ph,S,463,true,"Tissue atlas Arabidopsis - ProteomicsDB",114,32188942,"MaxQuant score",68.2770000,0.9997500,,,,0.0024739699438214,
KESFFGDR,ph,S,503,true,"Tissue atlas Arabidopsis - ProteomicsDB",114,32188942,"MaxQuant score",133.8900000,1.0000000,,,,0.0020655400585383,
VTGIMTNNKK,ph,T,521,true,"Tissue atlas Arabidopsis - ProteomicsDB",114,32188942,"MaxQuant score",110.4400000,0.9932930,,,,0.00051207200158387,
SSYLDNLGAMRSPTAR,ph,S,537,true,"Tissue atlas Arabidopsis - ProteomicsDB",114,32188942,"MaxQuant score",166.5200000,0.9994230,,,,9.1918605093092E-19,
