Peptide,PTM,ModifiedAA,ModifiedPosition,PeptideUniqueToGene,ExperimentDesc,ExpID,PubmedID,ScoreType,IdentScore,LocProb,Log2FChange,PQ-val,QuantSig,PEP,MassErrorPPM
GRVTTPSEEDSNNGLPVQQPGTPNQR,ph,T,6,true,"Tissue atlas Arabidopsis - ProteomicsDB",114,32188942,"MaxQuant score",159.0000000,0.7761330,,,,0,
GRVTTPSEEDSNNGLPVQQPGTPNQR,ph,T,23,true,"STN8 phosphoproteome",38,21768351,"MASCOT Score",88.2600000,,,,,,-0.9739860
GRVTTPSEEDSNNGLPVQQPGTPNQR,ph,T,23,true,"Chloroplast kinase substrates",60,19376835,"MASCOT Score",86.2500000,,,,,,-0.9739860
VTTPSEEDSNNGLPVQQPGTPNQR,ph,T,23,true,"Phosphorylation Early Elicitor Signaling",23,17317660,,,,,,,,
VTTPSEEDSNNGLPVQQPGTPNQR,ph,T,23,true,"STN8 phosphoproteome",38,21768351,"MASCOT Score",113.9600000,,,,,,-1.0958400
VTTPSEEDSNNGLPVQQPGTPNQR,ph,T,23,true,"Large-scale phosphorylation discovery",44,23111157,XCorr,4.1090000,,,,,,
VTTPSEEDSNNGLPVQQPGTPNQR,ph,T,23,true,"Chloroplast kinase substrates",60,19376835,"MASCOT Score",40.9300000,,,,,,-1.6398100
VTTPSEEDSNNGLPVQQPGTPNQR,ph,T,23,true,"Phosphorylation in N starvation",63,22060019,"MASCOT Score",30.0000000,,,,,,-4.0455800
VTTPSEEDSNNGLPVQQPGTPNQR,ph,T,23,true,"srk2dei ABA signaling phopshoproteomics",83,23572148,"MASCOT Score",49.0000000,,,,,,0.0009000
VTTPSEEDSNNGLPVQQPGTPNQR,ph,T,23,true,"LAXIC - ABA stress",84a,23660473,XCorr,6.0200000,1.0000000,,,,2.3200000498491E-7,
VTTPSEEDSNNGLPVQQPGTPNQR,ph,T,23,true,"SnRK2 protein kinase substrates",85,23776212,XCorr,4.3109899,1.0000000,,,,4.238620121555E-8,
VTTPSEEDSNNGLPVQQPGTPNQR,ph,T,23,true,"atm and atr DNA damage response",88,25561503,"MASCOT Score",62.0000000,1.0000000,,,,,0.5800000
VTTPSEEDSNNGLPVQQPGTPNQR,ph,T,23,true,"TOR Kinase and ABA Receptor",100,29290610,XCorr,4.6250939,1.0000000,,,,4.2509999076401E-8,
VTTPSEEDSNNGLPVQQPGTPNQR,ph,T,23,true,"Lateral root-induction - NAA vs control",106,23328941,"MASCOT Score",30.0000000,,,,,,
VTTPSEEDSNNGLPVQQPGTPNQR,ph,T,23,true,"Tissue atlas Arabidopsis - ProteomicsDB",114,32188942,"MaxQuant score",171.3600000,1.0000000,,,,0,
EAPSFAPTNQYMSK,ph,S,180,true,"Tissue atlas Arabidopsis - ProteomicsDB",114,32188942,"MaxQuant score",134.1300000,1.0000000,,,,7.6762999015045E-6,
EAPSFAPTNQYMSK,ac,K,190,true,"Quantitative Acetylproteomics",101,29440448,,,,,,,,
