Peptide,PTM,ModifiedAA,ModifiedPosition,PeptideUniqueToGene,ExperimentDesc,ExpID,PubmedID,ScoreType,IdentScore,LocProb,Log2FChange,PQ-val,QuantSig,PEP,MassErrorPPM
NCYNFSLTAK,ng,N,90,true,"Conserved N-glycosylation",74,22633491,"MaxQuant Score",57.8010000,0.9950000,,,,0.046999998390675,0.1900000
LQICLVK,sno,C,156,false,"hot5-4 / wildtype, FAT-switch S-nitrosoproteome",169,37277371,,,,,,,,
TAAVPLNATQPLK,ng,N,251,true,"Conserved N-glycosylation",74,22633491,"MaxQuant Score",84.4390000,1.0000000,,,,0.00088579999282956,0.1940000
TAAVPLNATQPLK,ng,N,251,true,"UDP-GlcNAc transporter glycopeptide analysis",135,30224661,,,,,,,3.6637665123962E-11,0.4000000
SSWQGDPCAPELYR,sno,C,386,true,"hot5-4 / wildtype, FAT-switch S-nitrosoproteome",169,37277371,,,,,,,,
SFTTGTVKSDAR,ac,K,543,true,"Quantitative Acetylproteomics",101,29440448,,,,,,,,
ESVEFSPSSASDFSPLAR,ph,S,864,true,"TOR Kinase and ABA Receptor",100,29290610,XCorr,4.5567966,0.9914000,,,,3.1269999567485E-7,
ESVEFSPSSASDFSPLAR,ph,S,864,true,"Tissue atlas Arabidopsis - ProteomicsDB",114,32188942,"MaxQuant score",208.4300000,0.9999840,,,,0,
