Peptide,PTM,ModifiedAA,ModifiedPosition,PeptideUniqueToGene,ExperimentDesc,ExpID,PubmedID,ScoreType,IdentScore,LocProb,Log2FChange,PQ-val,QuantSig,PEP,MassErrorPPM
QDQPGFINVDCGLLPR,nt,Q,21,true,"HUNTER N-terminome: legumain, GluC and trypsin",119,31951383,"MaxQuant score",175.2800000,,,,,,
QDQPGFINVD,nt,Q,21,true,"HUNTER N-terminome: legumain, GluC and trypsin",119,31951383,"MaxQuant score",108.9300000,,,,,,
CGLLPR,so,C,31,false,"S-sulfenylation site detection using YAP1C",110,32714340,,,,,,,,
EFEENNSTPNLTLR,ng,N,71,true,"N-glycan occupancy Arabidopsis glycoproteins",87,23994444,"Ladder score",50.6000000,,,,,,
IAKEFEENNSTPNLTLR,ng,N,72,true,"Conserved N-glycosylation",74,22633491,"MaxQuant Score",198.7800000,0.9630000,,,,1.2479964123277E-41,0.1170000
IAKEFEENNSTPNLTLR,ng,N,76,true,"Conserved N-glycosylation",74,22633491,"MaxQuant Score",198.7800000,1.0000000,,,,1.2479964123277E-41,0.1170000
IAKEFEENNSTPNLTLR,ng,N,76,true,"UDP-GlcNAc transporter glycopeptide analysis",135,30224661,,,,,,,2.0839801238848E-12,1.0000000
EFEENNSTPNLTLR,ng,N,76,true,"N-glycan occupancy Arabidopsis glycoproteins",87,23994444,"Ladder score",50.6000000,,,,,,
EFEENNSTPNLTLR,ng,N,76,true,"N-linked Glycan Micro-heterogeneity Arabidopsis",134,29237727,,,,,,,,
EFEENNSTPNLTLR,ng,N,76,true,"UDP-GlcNAc transporter glycopeptide analysis",135,30224661,,,,,,,2.0855948041574E-15,1.3000000
NCYNLNVSR,ng,N,93,true,"Conserved N-glycosylation",74,22633491,"MaxQuant Score",173.3600000,0.9980000,,,,4.5810002120561E-6,-0.9560000
NCYNLNVSR,ng,N,93,true,"N-glycan occupancy Arabidopsis glycoproteins",87,23994444,"Ladder score",68.6000000,,,,,,
NCYNLNVSR,ng,N,93,true,"N-linked Glycan Micro-heterogeneity Arabidopsis",134,29237727,,,,,,,,
NCYNLNVSR,ng,N,93,true,"UDP-GlcNAc transporter glycopeptide analysis",135,30224661,,,,,,,7.9414267020184E-6,0.6000000
SDSLQVCLAK,sno,C,153,true,"hot5-4 / wildtype, FAT-switch S-nitrosoproteome",169,37277371,,,,0.0512694,0.8289860,NO,,
NVQNAYGLINR,ng,N,374,true,"Conserved N-glycosylation",74,22633491,"MaxQuant Score",147.6900000,0.9980000,,,,1.9760000656132E-13,-0.7550000
NVQNAYGLINR,ng,N,374,true,"N-linked Glycan Micro-heterogeneity Arabidopsis",134,29237727,,,,,,,,
NVQNAYGLINR,ng,N,374,true,"UDP-GlcNAc transporter glycopeptide analysis",135,30224661,,,,,,,5.246875850462E-12,0.7000000
SSWQGDPCVPK,ox,C,383,true,"SPEAR - 10 mM H2O2 / mock",138a,34619326,,,,-1.1013873,0.0452196,YES,,
GNNLSGPVPASLLQK,ng,N,462,true,"Conserved N-glycosylation",74,22633491,"MaxQuant Score",123.9100000,0.8720000,,,,1.2849999384869E-13,-0.7200000
GNNLSGPVPASLLQK,ng,N,462,true,"N-glycan occupancy Arabidopsis glycoproteins",87,23994444,"Ladder score",64.4000000,,,,,,
GNNLSGPVPASLLQK,ng,N,462,true,"N-linked Glycan Micro-heterogeneity Arabidopsis",134,29237727,,,,,,,,
GNNLSGPVPASLLQK,ng,N,462,true,"UDP-GlcNAc transporter glycopeptide analysis",135,30224661,,,,,,,3.6637665670933E-17,0.8000000
VEGTLPSYMQASDGRSPR,ph,S,543,true,"TOR Kinase and ABA Receptor",100,29290610,XCorr,3.0199282,0.8968000,,,,0.00066680001327768,
VEGTLPSYMQASDGRSPR,ph,S,543,true,"Phosphorylation tonoplast membrane fraction",107,18686298,"MASCOT Score",23.0000000,,,,,,
VEGTLPSYMQASDGRSPR,ph,S,548,true,"atm and atr DNA damage response",88,25561503,"MASCOT Score",36.0000000,0.9920000,,,,,-0.2600000
VEGTLPSYMQASDGRSPR,ph,S,548,true,"Tissue atlas Arabidopsis - ProteomicsDB",114,32188942,"MaxQuant score",137.1200000,0.7892600,,,,2.6124399799872E-15,
ASKVEGTLPSYMQASDGRSPR,ph,S,552,true,"Phosphoproteome ethylene-regulated time response",46,24043427,"MASCOT Score",29.9600000,,,,,,-10.2136000
VEGTLPSYMQASDGRSPR,ph,S,552,true,"Chloroplast kinase substrates",60,19376835,"MASCOT Score",37.4800000,,,,,,-1.0571100
VEGTLPSYMQASDGRSPR,ph,S,552,true,"atm and atr DNA damage response",88,25561503,"MASCOT Score",37.0000000,1.0000000,,,,,-1.1500000
VEGTLPSYMQASDGRSPR,ph,S,552,true,"TOR Kinase and ABA Receptor",100,29290610,XCorr,3.6854024,1.0000000,,,,0.0018390000332147,
VEGTLPSYMQASDGRSPR,ph,S,552,true,"Phosphorylation tonoplast membrane fraction",107,18686298,"MASCOT Score",38.0000000,,,,,,
VEGTLPSYMQASDGRSPR,ph,S,552,true,"Tissue atlas Arabidopsis - ProteomicsDB",114,32188942,"MaxQuant score",245.2200000,0.9999420,,,,0,
SSEPAIVTK,ph,S,555,false,"atm and atr DNA damage response",88,25561503,"MASCOT Score",33.0000000,0.9640000,,,,,-0.0100000
SSEPAIVTK,ph,S,556,false,"atm and atr DNA damage response",88,25561503,"MASCOT Score",42.0000000,0.9980000,,,,,-0.5700000
SSEPAIVTK,ph,S,556,false,"Tissue atlas Arabidopsis - ProteomicsDB",114,32188942,"MaxQuant score",87.0660000,0.9468020,,,,0.0028422400355339,
ILSHSSSQGYK,ph,S,612,false,"Tissue atlas Arabidopsis - ProteomicsDB",114,32188942,"MaxQuant score",119.5200000,0.9442650,,,,1.2329100172792E-5,
