Peptide,PTM,ModifiedAA,ModifiedPosition,PeptideUniqueToGene,ExperimentDesc,ExpID,PubmedID,ScoreType,IdentScore,LocProb,Log2FChange,PQ-val,QuantSig,PEP,MassErrorPPM
ASNAAVPFWRAAG,nt,A,2,true,"Arg/N-end rule seed, prt6 vs. Wt",99,29168982,"MASCOT Score",32.7500000,,,,,0.00013810000382364,-2.1685045
ASNAAVPFWR,nt,A,2,true,"N-term acetylation drought responses",5,26184543,,,,,,,,
ASNAAVPFWR,nt,A,2,true,"Arg/N-end rule pathway Roots",80,25728785,"MASCOT Score",54.9300000,,,,,0.0028419999871403,
ASNAAVPFWR,nt,A,2,true,"Tic56 chloroplast import - wild-type",89a,25588737,XCorr,2.7720938,,,,,,
ASNAAVPFWR,nt,A,2,true,"Tic56 chloroplast import - tic56-1",89c,25588737,XCorr,2.9994216,,,,,,
ASNAAVPFWR,nt,A,2,true,"N-terminal ChaFRADIC",92,26010716,"MASCOT Score",49.8200000,,,,,0.0019120000069961,
ASNAAVPFWR,nt,A,2,true,"Arg/N-end rule seed, prt6 vs. Wt",99,29168982,"MASCOT Score",49.4400000,,,,,0.034650001674891,-0.6413377
ASNAAVPFWR,nt,A,2,true,"Mitochondrial intermediate peptidases - icp55 / WT",131a,25732537,,60.8100000,,3.2869383,,,,
ASNAAVPF,nt,A,2,true,"Arg/N-end rule seed, prt6 vs. Wt",99,29168982,"MASCOT Score",46.1700000,,-0.4625704,0.0373245,NO,0.1123000010848,-0.0149929
ASNAAVPFWRAAG,nta,A,2,true,"Arg/N-end rule seed, prt6 vs. Wt",99,29168982,"MASCOT Score",32.7500000,,,,,0.00013810000382364,-2.1685045
ASNAAVPFWR,nta,A,2,true,"N-term acetylation drought responses",5,26184543,,,,,,,,
ASNAAVPFWR,nta,A,2,true,"Characterization plant N-terminal acetylation",6,22223895,"MASCOT Score",58.3500000,,,,,,
ASNAAVPFWR,nta,A,2,true,"N-terminal ChaFRADIC",92,26010716,"MASCOT Score",49.8200000,,,,,0.0019120000069961,
ASNAAVPFWR,nta,A,2,true,"Arg/N-end rule seed, prt6 vs. Wt",99,29168982,"MASCOT Score",49.4400000,,,,,0.034650001674891,-0.6413377
ASNAAVPFWR,nta,A,2,true,"Mitochondrial intermediate peptidases - icp55 / WT",131a,25732537,,67.8100000,,,,,,
ASNAAVPFWR,nta,A,2,true,"Mitochondrial intermediate peptidases - oct1-1 / WT",131b,25732537,,80.8000000,,,,,,
ASNAAVPFWR,nta,A,2,true,"Mitochondrial intermediate peptidases - oct1-2 / WT",131c,25732537,,76.1100000,,,,,,
AAGMTYISYSNICANIVR,ox,C,24,true,"Redox kickstart of mitochondria",112,31871212,,,,-1.7934755,0.0000123,YES,,
NCLKEPHK,so,C,31,true,"S-sulfenylation site detection using YAP1C",110,32714340,,,,,,,,
NCLKEPHKAEALTR,ub,K,37,true,"Arabidopsis ubiquitination COFRADIC",40,26744219,"MaxQuant Score",69.3310000,0.9990000,,,,3.72099998458E-6,0.0990000
