Peptide,PTM,ModifiedAA,ModifiedPosition,PeptideUniqueToGene,ExperimentDesc,ExpID,PubmedID,ScoreType,IdentScore,LocProb,Log2FChange,PQ-val,QuantSig,PEP,MassErrorPPM
MDDLHGSNAR,nta,M,1,true,"Arg/N-end rule pathway Roots",80,25728785,"MASCOT Score",63.1600000,,,,,0.00012519999290816,
MDDLHGSNAR,nta,M,1,true,"Arg/N-end rule seed, prt6 vs. Wt",99,29168982,"MASCOT Score",62.9600000,,,,,0.014510000124574,-0.6694708
MDDLHGSNAR,nta,M,1,true,"Arabidopsis translation initiation landscape - NTA",167a,35069635,,,,,,,,
ELPQAAPPGLGSPHQNNR,ph,S,125,true,"srk2dei ABA signaling phopshoproteomics",83,23572148,"MASCOT Score",23.0000000,,,,,,0.0009000
ELPQAAPPGLGSPHQNNR,ph,S,125,true,"atm and atr DNA damage response",88,25561503,"MASCOT Score",38.0000000,1.0000000,,,,,-0.0400000
ELPQAAPPGLGSPHQNNR,ph,S,125,true,"Phospho cell culture sucrose/TOR",109,30833711,,,1.0000000,,,,,
ELPQAAPPGLGSPHQNNR,ph,S,125,true,"Tissue atlas Arabidopsis - ProteomicsDB",114,32188942,"MaxQuant score",182.8200000,1.0000000,,,,1.5331900210336E-35,
ELPQAAPPGLGSPHQNNR,ph,S,125,true,"Touch-induced phosphorylation: 40s touch vs untouc",136,30291188,"MASCOT score",76.4500000,,0.3329958,0.3760113,NO,,3.6251391
VSSLPGTPQR,ph,S,133,true,"atm and atr DNA damage response",88,25561503,"MASCOT Score",40.0000000,0.9920000,,,,,0.4100000
VSSLPGTPQR,ph,S,134,true,"atm and atr DNA damage response",88,25561503,"MASCOT Score",37.0000000,1.0000000,,,,,-0.0500000
VSSLPGTPQR,ph,S,134,true,"TOR Kinase and ABA Receptor",100,29290610,XCorr,2.5400455,0.9860000,,,,0.017899999395013,
VSSLPGTPQR,ph,S,134,true,"Phospho cell culture sucrose/TOR",109,30833711,,,0.8061990,,,,,
VSSLPGTPQR,ph,S,134,true,"Tissue atlas Arabidopsis - ProteomicsDB",114,32188942,"MaxQuant score",117.2500000,0.9999340,,,,0.00017312700219918,
VSSLPGTPQR,ph,T,138,true,"atm and atr DNA damage response",88,25561503,"MASCOT Score",40.0000000,1.0000000,,,,,0.4100000
VSSLPGTPQR,ph,T,138,true,"Tissue atlas Arabidopsis - ProteomicsDB",114,32188942,"MaxQuant score",151.9800000,0.9999990,,,,1.8407999959891E-6,
ASPQTAQNLPLNK,ph,S,267,true,"TOR Kinase and ABA Receptor",100,29290610,XCorr,3.0000868,0.8970000,,,,0.0012959999730811,
ASPQTAQNLPLNK,ph,S,267,true,"Tissue atlas Arabidopsis - ProteomicsDB",114,32188942,"MaxQuant score",232.5600000,0.9999960,,,,0,
