Peptide,PTM,ModifiedAA,ModifiedPosition,PeptideUniqueToGene,ExperimentDesc,ExpID,PubmedID,ScoreType,IdentScore,LocProb,Log2FChange,PQ-val,QuantSig,PEP,MassErrorPPM
MEFSTSKRPATTATAAESVHFR,nta,M,1,true,"Arabidopsis translation initiation landscape - NTA",167a,35069635,,,,,,,,
GNQVDYLMSKGGK,ph,Y,161,true,"Phosphorylation in N starvation",63,22060019,"MASCOT Score",20.0000000,,,,,,-1.0185600
TVQDALFQILCR,so,C,430,true,"S-sulfenylation site detection using YAP1C",110,32714340,,,,,,,,
QYPASPDRYHSPVGPFHER,ph,S,472,true,"atm and atr DNA damage response",88,25561503,"MASCOT Score",23.0000000,1.0000000,,,,,-1.0200000
QYPASPDRYHSPVGPFHER,ph,S,472,true,"Phospho cell culture sucrose/TOR",109,30833711,,,0.9864220,,,,,
QYPASPDRYHSPVGPFHER,ph,S,472,true,"Tissue atlas Arabidopsis - ProteomicsDB",114,32188942,"MaxQuant score",104.8100000,0.9999760,,,,3.8139400970749E-8,
QYPASPDRYHSPVGPFHER,ph,S,478,true,"atm and atr DNA damage response",88,25561503,"MASCOT Score",23.0000000,1.0000000,,,,,-1.0200000
YHSPVGPFHER,ph,S,478,true,"STN8 phosphoproteome",38,21768351,"MASCOT Score",45.1400000,,,,,,-0.3672250
YHSPVGPFHER,ph,S,478,true,"atm and atr DNA damage response",88,25561503,"MASCOT Score",44.0000000,1.0000000,,,,,0.5300000
YHSPVGPFHER,ph,S,478,true,"Tissue atlas Arabidopsis - ProteomicsDB",114,32188942,"MaxQuant score",154.2800000,1.0000000,,,,2.1271299999182E-10,
