Peptide,PTM,ModifiedAA,ModifiedPosition,PeptideUniqueToGene,ExperimentDesc,ExpID,PubmedID,ScoreType,IdentScore,LocProb,Log2FChange,PQ-val,QuantSig,PEP,MassErrorPPM
ANIESEAVDFEPEEDDLMDEEGTAIDGADVSPR,ph,S,32,true,"Arabidopsis root NAA phosphoproteome",18a,27643528,"MaxQuant Score",103.9900000,1.0000000,,,,6.113000188511E-14,-0.2800000
ANIESEAVDFEPEEDDLMDEEGTAIDGADVSPR,ph,S,32,true,"Phospho cell culture sucrose/TOR",109,30833711,,,0.9999100,,,,,
SAIAGANGE,nt,S,42,true,"Arg/N-end rule seed, prt6 vs. Wt",99,29168982,"MASCOT Score",32.3700000,,-0.3783119,0.1408496,NO,0.032650001347065,-0.3935240
LKSAIAGANGESAKK,ph,S,42,true,"Tissue atlas Arabidopsis - ProteomicsDB",114,32188942,"MaxQuant score",71.2630000,1.0000000,,,,0.00021436599490698,
SAIAGANGESAKK,ph,S,51,true,"Large-scale phosphorylation discovery",44,23111157,XCorr,2.0690000,,,,,,
SAIAGANGESAKK,ph,S,51,true,"atm and atr DNA damage response",88,25561503,"MASCOT Score",51.0000000,1.0000000,,,,,-2.2900000
SAIAGANGESAKK,ph,S,51,true,"Tissue atlas Arabidopsis - ProteomicsDB",114,32188942,"MaxQuant score",225.3600000,1.0000000,,,,0,
LKSAIAGANGESAKKTKGR,ub,K,53,true,"Arabidopsis ubiquitination COFRADIC",40,26744219,"MaxQuant Score",97.2710000,0.7870000,,,,2.8860001546763E-14,-0.0830000
GRGFREEK,me1,R,58,true,"Arabidopsis protein methylome",123,31809900,"MaxQuant Score",43.8080000,0.8765420,,,,0.013574199751019,0.4496800
GFREEKDSDR,ub,K,64,true,"Arabidopsis ubiquitination COFRADIC",40,26744219,"MaxQuant Score",138.2200000,1.0000000,,,,9.5430004876107E-7,0.0790000
LSSRDFESLGSDGRPGPQR,ph,S,74,true,"Phospho cell culture sucrose/TOR",109,30833711,,,0.9788420,,,,,
LSSRDFESLGSDGRPGPQR,ph,S,74,true,"Tissue atlas Arabidopsis - ProteomicsDB",114,32188942,"MaxQuant score",133.6800000,0.9989290,,,,1.2481399995915E-15,
LSSRDFESLGSDGR,ph,S,74,true,"atm and atr DNA damage response",88,25561503,"MASCOT Score",37.0000000,0.9970000,,,,,0.1300000
DFESLGSDGR,nt,D,76,true,"Arg/N-end rule seed, prt6 vs. Wt",99,29168982,"MASCOT Score",49.2900000,,-1.4759689,0.1258518,NO,0.016160000115633,-2.5267837
DFESLGSDGRPGPQR,ph,S,79,true,"atm and atr DNA damage response",88,25561503,"MASCOT Score",21.0000000,1.0000000,,,,,-1.3900000
DFESLGSDGRPGPQR,ph,S,79,true,"Phospho cell culture sucrose/TOR",109,30833711,,,0.9673920,,,,,
DFESLGSDGRPGPQR,ph,S,79,true,"Tissue atlas Arabidopsis - ProteomicsDB",114,32188942,"MaxQuant score",156.9600000,0.9999970,,,,6.0001201056259E-12,
DFESLGSDGRPGPQR,ph,S,82,true,"atm and atr DNA damage response",88,25561503,"MASCOT Score",20.0000000,0.9930000,,,,,0.1000000
DFESLGSDGRPGPQR,ph,S,82,true,"Tissue atlas Arabidopsis - ProteomicsDB",114,32188942,"MaxQuant score",138.1900000,0.9999950,,,,1.4038399740457E-6,
