Peptide,PTM,ModifiedAA,ModifiedPosition,PeptideUniqueToGene,ExperimentDesc,ExpID,PubmedID,ScoreType,IdentScore,LocProb,Log2FChange,PQ-val,QuantSig,PEP,MassErrorPPM
AGRGKTLGSG,nt,A,2,false,"N-term acetylation drought responses",5,26184543,,,,,,,,
GKTLGSGSAKKATTR,ac,K,6,true,"Histone deacetylases - apicidin vs control",98a,29061669,"MaxQuant Score",150.5000000,1.0000000,0.3340000,0.4017908,NO,6.1000000698992E-26,
GKTLGSGSAKKATTR,ac,K,6,true,"Histone deacetylases substrates - hda14 vs WT",98e,29061669,"MaxQuant Score",96.7000000,1.0000000,-0.0270000,0.9705100,NO,6.1999998024476E-7,
GKTLGSGSAKK,ac,K,6,true,"Histone deacetylases- hda14 vs WT (low light)",98c,29061669,"MaxQuant Score",186.5100000,1.0000000,0.0450000,0.9931160,NO,3.0000000261765E-9,
GKTLGSGSAKK,ac,K,6,true,"Histone deacetylases - hda14 vs WT (thylakoids)",98d,29061669,"MaxQuant Score",124.0000000,1.0000000,-0.0420000,0.9954054,NO,0.00032099999953061,
GKTLGSGSAKK,ac,K,6,true,"Quantitative Acetylproteomics",101,29440448,,,,,,,,
GKTLGSGSAK,ac,K,6,true,"Quantitative Acetylproteomics",101,29440448,,,,,,,,
GKTLGSGSAKKATTR,ub,K,6,true,"Arabidopsis ubiquitination COFRADIC",40,26744219,"MaxQuant Score",117.5300000,1.0000000,,,,1.2289999781639E-22,0.6720000
TLGSGSAKK,ph,S,12,true,"atm and atr DNA damage response",88,25561503,"MASCOT Score",36.0000000,1.0000000,,,,,-2.8000000
GKTLGSGSAKKATTR,ac,K,14,true,"Histone deacetylases - apicidin vs control",98a,29061669,"MaxQuant Score",150.5000000,1.0000000,0.3340000,0.4017908,NO,6.1000000698992E-26,
GKTLGSGSAKKATTR,ac,K,14,true,"Histone deacetylases substrates - hda14 vs WT",98e,29061669,"MaxQuant Score",96.7000000,1.0000000,-0.0270000,0.9705100,NO,6.1999998024476E-7,
GKTLGSGSAKK,ac,K,14,true,"Histone deacetylases- hda14 vs WT (low light)",98c,29061669,"MaxQuant Score",186.5100000,1.0000000,0.0450000,0.9931160,NO,3.0000000261765E-9,
GKTLGSGSAKK,ac,K,14,true,"Histone deacetylases - hda14 vs WT (thylakoids)",98d,29061669,"MaxQuant Score",124.0000000,1.0000000,-0.0420000,0.9954054,NO,0.00032099999953061,
GKTLGSGSAKK,ac,K,14,true,"Quantitative Acetylproteomics",101,29440448,,,,,,,,
TLGSGSAKK,ac,K,14,true,"Quantitative Acetylproteomics",101,29440448,,,,,,,,
GKTLGSGSAKKATTR,ub,K,14,true,"Arabidopsis ubiquitination COFRADIC",40,26744219,"MaxQuant Score",127.8300000,0.9000000,,,,5.3219999886289E-22,-0.1660000
GKTLGSGSAKKATTR,ac,K,15,true,"Histone deacetylases - apicidin vs control",98a,29061669,"MaxQuant Score",150.5000000,1.0000000,0.3340000,0.4017908,NO,6.1000000698992E-26,
GKTLGSGSAKKATTR,ac,K,15,true,"Histone deacetylases substrates - hda14 vs WT",98e,29061669,"MaxQuant Score",96.7000000,1.0000000,-0.0270000,0.9705100,NO,6.1999998024476E-7,
GKTLGSGSAKKATTR,ub,K,15,true,"Arabidopsis ubiquitination COFRADIC",40,26744219,"MaxQuant Score",97.9040000,0.8190000,,,,3.3660001008684E-8,-0.1530000
SSKAGLQFPVGR,ub,K,22,false,"Arabidopsis ubiquitination COFRADIC",40,26744219,"MaxQuant Score",150.5100000,1.0000000,,,,1.7890000563181E-20,0.3340000
SSKAGLQFPVGR,ub,K,22,false,"upl3 mutant / wildtype",168,35926874,"MaxQuant score",98.1820000,1.0000000,0.1296127,0.8544800,NO,6.7022199800704E-5,0.4765700
FLKKGKYAER,ub,K,40,true,"Arabidopsis ubiquitination COFRADIC",40,26744219,"MaxQuant Score",125.9700000,0.9970000,,,,7.7830001828261E-5,-1.4050000
AAEVLELAGNAAR,nt,A,61,false,"Metacaspase9 substrates - Col-0 / mc9",51a,23964026,"MASCOT Score",70.0000000,,1.0806794,,NO,,-1.1784287
LLGDVTIANGGVMPNIHNLLLPKK,ub,K,120,false,"upl3 mutant / wildtype",168,35926874,"MaxQuant score",71.1480000,1.0000000,0.7415748,0.2433000,NO,1.2171500429758E-7,-0.8636800
KTGASKPSAEDD,ph,T,122,true,"atm and atr DNA damage response",88,25561503,"MASCOT Score",27.0000000,1.0000000,,,,,-0.4000000
KTGASKPSAEDD,ph,S,128,true,"atm and atr DNA damage response",88,25561503,"MASCOT Score",26.0000000,1.0000000,,,,,-3.8100000
