Peptide,PTM,ModifiedAA,ModifiedPosition,PeptideUniqueToGene,ExperimentDesc,ExpID,PubmedID,ScoreType,IdentScore,LocProb,Log2FChange,PQ-val,QuantSig,PEP,MassErrorPPM
SRPETPLLK,ph,S,62,true,"Large-scale phosphorylation discovery",44,23111157,XCorr,3.1600000,,,,,,
SRPETPLLK,ph,S,62,true,"atm and atr DNA damage response",88,25561503,"MASCOT Score",26.0000000,1.0000000,,,,,-0.1400000
SRPETPLLK,ph,S,62,true,"Tissue atlas Arabidopsis - ProteomicsDB",114,32188942,"MaxQuant score",88.0210000,0.9995130,,,,0.0049986401572824,
SRPETPLLK,ph,T,66,true,"Large-scale phosphorylation discovery",44,23111157,XCorr,3.1600000,,,,,,
SRPETPLLK,ph,T,66,true,"atm and atr DNA damage response",88,25561503,"MASCOT Score",36.0000000,1.0000000,,,,,-1.4100000
SGVVEDDDYEDDNHQVARSETTR,ph,S,99,true,"atm and atr DNA damage response",88,25561503,"MASCOT Score",49.0000000,0.9870000,,,,,-0.1300000
LQVPDASSSGGER,ph,S,133,true,"atm and atr DNA damage response",88,25561503,"MASCOT Score",39.0000000,0.9380000,,,,,-0.0600000
LQVPDASSSGGER,ph,S,133,true,"Tissue atlas Arabidopsis - ProteomicsDB",114,32188942,"MaxQuant score",100.1100000,0.8242260,,,,0.00021863699657843,
LQVPDASSSGGER,ph,S,134,true,"atm and atr DNA damage response",88,25561503,"MASCOT Score",39.0000000,0.9950000,,,,,-0.0600000
AEIEALKR,me2,K,367,true,"Arabidopsis protein methylome",123,31809900,"MaxQuant Score",87.1810000,1.0000000,,,,0.0051641599275172,-0.1735100
ETAASVNIQEIK,ph,S,448,true,"Tissue atlas Arabidopsis - ProteomicsDB",114,32188942,"MaxQuant score",128.6100000,0.9998810,,,,3.7911198887741E-5,
SVAYSPISHDSK,ph,S,491,true,"atm and atr DNA damage response",88,25561503,"MASCOT Score",39.0000000,1.0000000,,,,,-1.0300000
SVAYSPISHDSK,ph,S,491,true,"Tissue atlas Arabidopsis - ProteomicsDB",114,32188942,"MaxQuant score",225.7200000,0.9999990,,,,0,
SVAYSPISHDSK,ph,S,494,true,"atm and atr DNA damage response",88,25561503,"MASCOT Score",39.0000000,1.0000000,,,,,-1.0300000
SVAYSPISHDSK,ph,S,494,true,"TOR Kinase and ABA Receptor",100,29290610,XCorr,4.2279119,0.9998000,,,,0.00441600009799,
SVAYSPISHDSK,ph,S,494,true,"Tissue atlas Arabidopsis - ProteomicsDB",114,32188942,"MaxQuant score",100.5600000,0.9974450,,,,0.00010364699846832,
SSAGMVSPDRVSSK,ph,S,649,true,"atm and atr DNA damage response",88,25561503,"MASCOT Score",25.0000000,1.0000000,,,,,-1.1200000
SSAGMVSPDRVSSK,ph,S,649,true,"Tissue atlas Arabidopsis - ProteomicsDB",114,32188942,"MaxQuant score",126.1400000,0.9999940,,,,5.9783999972751E-9,
SSAGMVSPDR,ph,S,649,true,"atm and atr DNA damage response",88,25561503,"MASCOT Score",31.0000000,1.0000000,,,,,0.7600000
SSAGMVSPDRVSSK,ph,S,654,true,"atm and atr DNA damage response",88,25561503,"MASCOT Score",25.0000000,0.9930000,,,,,-1.1200000
SSAGMVSPDRVSSK,ph,S,654,true,"Tissue atlas Arabidopsis - ProteomicsDB",114,32188942,"MaxQuant score",126.1400000,0.9504450,,,,5.9783999972751E-9,
GCIEWPR,so,C,689,false,"S-sulfenylation site detection using YAP1C",110,32714340,,,,,,,,
