Peptide,PTM,ModifiedAA,ModifiedPosition,PeptideUniqueToGene,ExperimentDesc,ExpID,PubmedID,ScoreType,IdentScore,LocProb,Log2FChange,PQ-val,QuantSig,PEP,MassErrorPPM
MESPHSEASIVNGSIHLNGSGETK,ph,S,3,true,"atm and atr DNA damage response",88,25561503,"MASCOT Score",59.0000000,0.9980000,,,,,-0.5800000
MESPHSEASIVNGSIHLNGSGETK,ph,S,3,true,"Tissue atlas Arabidopsis - ProteomicsDB",114,32188942,"MaxQuant score",320.6600000,0.9999970,,,,0,
DIHNICIYHK,so,C,55,false,"Arabidopsis S-sulfenylation chemoproteomics",108,31578252,"pFind PSM Score",0.0328672,,1.8518500,,,,-1.4356950
LCLTNDPENSLSTK,sno,C,67,true,"Site-specific nitrosomeproteomic id - gsnor1-3",90b,25699590,XCorr,2.9600000,,,,,0.036540001630783,-7.6800000
LCLTNDPENSLSTK,so,C,67,true,"S-sulfenylation site detection using YAP1C",110,32714340,,,,,,,,
IVCENNQMVSK,ph,S,211,true,"Tissue atlas Arabidopsis - ProteomicsDB",114,32188942,"MaxQuant score",150.2200000,1.0000000,,,,1.7472800095675E-8,
QSSEGNNSDSEQEAK,ph,S,282,true,"atm and atr DNA damage response",88,25561503,"MASCOT Score",53.0000000,0.9380000,,,,,1.0800000
QSSEGNNSDSEQEAKKPTDIIK,ph,S,287,true,"Arabidopsis root NAA phosphoproteome",18a,27643528,"MaxQuant Score",45.0420000,0.8650000,,,,0.00082999997539446,0.1580000
QSSEGNNSDSEQEAKKPTDIIK,ph,S,287,true,"STN8 phosphoproteome",38,21768351,"MASCOT Score",54.9100000,,,,,,0.2091120
QSSEGNNSDSEQEAKKPTDIIK,ph,S,287,true,"Chloroplast kinase substrates",60,19376835,"MASCOT Score",44.3400000,,,,,,0.0040555
QSSEGNNSDSEQEAKKPTDIIK,ph,S,287,true,"Col-0 callus - FC Col-0 vs. Col-0 Xray",111a,31410901,,25.6800000,,1.7942849,0.0302293,YES,,1.0612156
QSSEGNNSDSEQEAKKPTDIIK,ph,S,287,true,"Col-0 X-ray callus - FC Col-0 vs. Col-0 Xray",111b,31410901,,25.6800000,,1.7942849,0.0302293,YES,,1.0612156
QSSEGNNSDSEQEAKKPTDIIK,ph,S,287,true,"atm callus - FC atm vs. atm Xray",111c,31410901,,25.6800000,,0.5363436,0.7110597,NO,,1.0612156
QSSEGNNSDSEQEAKKPTDIIK,ph,S,287,true,"atm-3 X-ray callus - FC atm vs. atm Xray",111d,31410901,,25.6800000,,0.5363436,0.7110597,NO,,1.0612156
QSSEGNNSDSEQEAKKPTDIIK,ph,S,287,true,"Tissue atlas Arabidopsis - ProteomicsDB",114,32188942,"MaxQuant score",191.5100000,0.9991740,,,,0,
QSSEGNNSDSEQEAK,ph,S,287,true,"SnRK2 protein kinase substrates",85,23776212,XCorr,3.4143798,0.9950000,,,,0.0010255699744448,
QSSEGNNSDSEQEAK,ph,S,287,true,"atm and atr DNA damage response",88,25561503,"MASCOT Score",92.0000000,1.0000000,,,,,-0.0300000
QSSEGNNSDSEQEAKKPTDIIK,ph,S,289,true,"Tissue atlas Arabidopsis - ProteomicsDB",114,32188942,"MaxQuant score",58.4620000,0.9986010,,,,0.000162319993251,
QSSEGNNSDSEQEAK,ph,S,289,true,"atm and atr DNA damage response",88,25561503,"MASCOT Score",33.0000000,1.0000000,,,,,0.5700000
KPTDIIKSGDLDK,ph,S,302,true,"Tissue atlas Arabidopsis - ProteomicsDB",114,32188942,"MaxQuant score",138.6900000,0.9998750,,,,1.0215465804928E-42,
SGDLDKTDEEAVVKPVLTVNIEPEQK,ph,T,308,true,"Tissue atlas Arabidopsis - ProteomicsDB",114,32188942,"MaxQuant score",93.1870000,0.9133730,,,,5.3792997837312E-16,
SLQQFTESLAK,ph,S,340,true,"Tissue atlas Arabidopsis - ProteomicsDB",114,32188942,"MaxQuant score",63.5550000,0.9999620,,,,0.0069729601964355,
SLQQFTESLAK,ph,S,347,true,"Tissue atlas Arabidopsis - ProteomicsDB",114,32188942,"MaxQuant score",147.3300000,0.9988710,,,,3.0161999120537E-8,
MKLPLDIDSPTQSENSSSSQQTPK,ph,S,359,true,"MAPK Arabidopsis substrates",45,23172892,"MaxQuant Score",48.0530000,,,,,,
MKLPLDIDSPTQSENSSSSQQTPK,ph,S,359,true,"srk2dei ABA signaling phopshoproteomics",83,23572148,"MASCOT Score",56.0000000,,,,,,0.0002000
MKLPLDIDSPTQSENSSSSQQTPK,ph,S,359,true,"Col-0 callus - FC Col-0 vs. Col-0 Xray",111a,31410901,,55.4100000,,1.5380488,0.0245127,YES,,1.0658564
MKLPLDIDSPTQSENSSSSQQTPK,ph,S,359,true,"Col-0 X-ray callus - FC Col-0 vs. Col-0 Xray",111b,31410901,,55.4100000,,1.5380488,0.0245127,YES,,1.0658564
MKLPLDIDSPTQSENSSSSQQTPK,ph,S,359,true,"atm callus - FC atm vs. atm Xray",111c,31410901,,55.4100000,,2.0902785,0.0065302,YES,,1.0658564
MKLPLDIDSPTQSENSSSSQQTPK,ph,S,359,true,"atm-3 X-ray callus - FC atm vs. atm Xray",111d,31410901,,55.4100000,,2.0902785,0.0065302,YES,,1.0658564
LPLDIDSPTQSENSSSSQQTPK,ph,S,359,true,"atm and atr DNA damage response",88,25561503,"MASCOT Score",42.0000000,1.0000000,,,,,-1.1900000
LPLDIDSPTQSENSSSSQQTPK,ph,S,359,true,"Phospho cell culture sucrose/TOR",109,30833711,,,0.8621280,,,,,
LPLDIDSPTQSENSSSSQQTPK,ph,S,359,true,"Tissue atlas Arabidopsis - ProteomicsDB",114,32188942,"MaxQuant score",357.5500000,0.9999880,,,,0,
MKLPLDIDSPTQSENSSSSQQTPKSASSR,ph,T,361,true,"MAPK Arabidopsis substrates",45,23172892,"MaxQuant Score",86.1820000,,,,,,
MKLPLDIDSPTQSENSSSSQQTPK,ph,T,361,true,"Tissue atlas Arabidopsis - ProteomicsDB",114,32188942,"MaxQuant score",173.0400000,0.9123640,,,,0,
LPLDIDSPTQSENSSSSQQTPK,ph,T,361,true,"TOR Kinase and ABA Receptor",100,29290610,XCorr,4.8816390,0.9593000,,,,4.2939998820657E-5,
LPLDIDSPTQSENSSSSQQTPK,ph,S,367,true,"Lateral root-induction - NAA vs control",106,23328941,"MASCOT Score",27.0000000,,,,,,
LPLDIDSPTQSENSSSSQQTPK,ph,S,368,true,"Lateral root-induction - NAA vs control",106,23328941,"MASCOT Score",66.0000000,,,,,,
MKLPLDIDSPTQSENSSSSQQTPK,ph,S,369,true,"MAPK Arabidopsis substrates",45,23172892,"MaxQuant Score",61.2220000,,,,,,
MKLPLDIDSPTQSENSSSSQQTPK,ph,T,372,true,"Large-scale phosphorylation discovery",44,23111157,XCorr,6.6890000,,,,,,
MKLPLDIDSPTQSENSSSSQQTPK,ph,T,372,true,"MAPK Arabidopsis substrates",45,23172892,"MaxQuant Score",209.9000000,,,,,,
MKLPLDIDSPTQSENSSSSQQTPK,ph,T,372,true,"srk2dei ABA signaling phopshoproteomics",83,23572148,"MASCOT Score",88.0000000,,,,,,0.0003000
MKLPLDIDSPTQSENSSSSQQTPK,ph,T,372,true,"SnRK2 protein kinase substrates",85,23776212,XCorr,6.7233171,0.9990000,,,,1.448989955799E-10,
MKLPLDIDSPTQSENSSSSQQTPK,ph,T,372,true,"Brassinosteroid-Regulated Phosphorylation Dynamics",94,26187819,"MaxQuant Score",93.8040000,0.9980000,,,,0.012000000104308,-1.8460000
MKLPLDIDSPTQSENSSSSQQTPK,ph,T,372,true,"Phospho cell culture sucrose/TOR",109,30833711,,,0.9999920,,,,,
MKLPLDIDSPTQSENSSSSQQTPK,ph,T,372,true,"Col-0 callus - FC Col-0 vs. Col-0 Xray",111a,31410901,,55.4100000,,1.5380488,0.0245127,YES,,1.0658564
MKLPLDIDSPTQSENSSSSQQTPK,ph,T,372,true,"Col-0 X-ray callus - FC Col-0 vs. Col-0 Xray",111b,31410901,,55.4100000,,1.5380488,0.0245127,YES,,1.0658564
MKLPLDIDSPTQSENSSSSQQTPK,ph,T,372,true,"atm callus - FC atm vs. atm Xray",111c,31410901,,55.4100000,,2.0902785,0.0065302,YES,,1.0658564
MKLPLDIDSPTQSENSSSSQQTPK,ph,T,372,true,"atm-3 X-ray callus - FC atm vs. atm Xray",111d,31410901,,55.4100000,,2.0902785,0.0065302,YES,,1.0658564
LPLDIDSPTQSENSSSSQQTPK,ph,T,372,true,"srk2dei ABA signaling phopshoproteomics",83,23572148,"MASCOT Score",52.0000000,,,,,,-0.0012000
LPLDIDSPTQSENSSSSQQTPK,ph,T,372,true,"LAXIC - ABA stress",84a,23660473,XCorr,3.9100000,0.9970000,,,,4.4299999779618E-10,
LPLDIDSPTQSENSSSSQQTPK,ph,T,372,true,"SnRK2 protein kinase substrates",85,23776212,XCorr,4.1136546,1.0000000,,,,3.2886998679871E-10,
LPLDIDSPTQSENSSSSQQTPK,ph,T,372,true,"atm and atr DNA damage response",88,25561503,"MASCOT Score",70.0000000,1.0000000,,,,,-0.3000000
LPLDIDSPTQSENSSSSQQTPK,ph,T,372,true,"TOR Kinase and ABA Receptor",100,29290610,XCorr,5.6291499,1.0000000,,,,3.0609999868147E-8,
LPLDIDSPTQSENSSSSQQTPK,ph,T,372,true,"Lateral root-induction - NAA vs control",106,23328941,"MASCOT Score",49.0000000,,,,,,
LPLDIDSPTQSENSSSSQQTPK,ph,T,372,true,"Col-0 callus - FC Col-0 vs. Col-0 Xray",111a,31410901,,76.6800000,,0.4451076,0.0000000,NO,,1.4089377
LPLDIDSPTQSENSSSSQQTPK,ph,T,372,true,"Col-0 X-ray callus - FC Col-0 vs. Col-0 Xray",111b,31410901,,76.6800000,,0.4451076,0.0000000,NO,,1.4089377
LPLDIDSPTQSENSSSSQQTPK,ph,T,372,true,"atm callus - FC atm vs. atm Xray",111c,31410901,,76.6800000,,1.4923545,0.0000000,NO,,1.4089377
LPLDIDSPTQSENSSSSQQTPK,ph,T,372,true,"atm-3 X-ray callus - FC atm vs. atm Xray",111d,31410901,,76.6800000,,1.4923545,0.0000000,NO,,1.4089377
LPLDIDSPTQSENSSSSQQTPK,ph,T,372,true,"Tissue atlas Arabidopsis - ProteomicsDB",114,32188942,"MaxQuant score",436.1400000,0.9999990,,,,0,
