Peptide,PTM,ModifiedAA,ModifiedPosition,PeptideUniqueToGene,ExperimentDesc,ExpID,PubmedID,ScoreType,IdentScore,LocProb,Log2FChange,PQ-val,QuantSig,PEP,MassErrorPPM
ASNSLLRSSS,nt,A,2,true,"N-term acetylation drought responses",5,26184543,,,,,,,,
ASNSLLRSSS,nta,A,2,true,"N-term acetylation drought responses",5,26184543,,,,,,,,
MASNSLLR,ph,S,5,true,"Phosphorylation in N starvation",63,22060019,"MASCOT Score",34.0000000,,,,,,7.8493500
VVDEPASPSVVIESQAVKPSTPSPLFIQN,nt,V,87,true,"HUNTER N-terminome: legumain, GluC and trypsin",119,31951383,"MaxQuant score",201.2100000,,,,,,
VVDEPASPSVVIE,nt,V,87,true,"N-terminal ChaFRADIC",92,26010716,"MASCOT Score",79.7300000,,,,,4.3329998788977E-7,
VVDEPASPSVVIE,nt,V,87,true,"Arg/N-end rule seed, prt6 vs. Wt",99,29168982,"MASCOT Score",70.5300000,,0.5441944,0.1583429,NO,7.7940003393451E-6,-1.8954522
VVDEPASPSVVIE,nt,V,87,true,"HUNTER N-terminome: legumain, GluC and trypsin",119,31951383,"MaxQuant score",108.1500000,,,,,,
VVDEPASPS,nt,V,87,true,"N-terminal ChaFRADIC",92,26010716,"MASCOT Score",52.9200000,,,,,0.0022279999684542,
APSPKSSDLPEGSQWR,ac,K,124,true,"Quantitative Acetylproteomics",101,29440448,,,,,,,,
LELQEVVDFLKNPDK,ac,K,282,false,"Histone deacetylases - apicidin vs control",98a,29061669,"MaxQuant Score",125.4000000,1.0000000,-0.2630000,0.2944422,NO,9.999999960042E-12,
NPDKYTALGAK,ac,K,286,false,"Histone deacetylases - apicidin vs control",98a,29061669,"MaxQuant Score",57.2000000,1.0000000,0.3230000,0.1104079,NO,0.0060000000521541,
NPDKYTALGAK,ac,K,286,false,"Histone deacetylases substrates - TSA vs control",98b,29061669,"MaxQuant Score",57.2000000,1.0000000,-0.1690000,0.9977001,NO,0.0060000000521541,
NPDKYTALGAK,ac,K,286,false,"Histone deacetylases - hda14 vs WT (thylakoids)",98d,29061669,"MaxQuant Score",57.2000000,1.0000000,0.0660000,0.9931160,NO,0.014000000432134,
YTALGAKIPK,ac,K,293,false,"Quantitative Acetylproteomics",101,29440448,,,,,,,,
GCLLVGPPGTGK,sno,C,298,false,"hot5-4 / wildtype, FAT-switch S-nitrosoproteome",169,37277371,,,,-0.4001532,0.0949422,NO,,
VRDLFEKAK,ac,K,349,false,"Histone deacetylases - hda14 vs WT (thylakoids)",98d,29061669,"MaxQuant Score",97.8000000,1.0000000,-0.1510000,0.9571941,NO,0.0070000002160668,
VRDLFEKAK,ac,K,349,false,"Quantitative Acetylproteomics",101,29440448,,,,,,,,
DLFEKAK,ac,K,349,false,"Quantitative Acetylproteomics",101,29440448,,,,,,,,
APCIVFIDEIDAVGR,sno,C,356,false,"hot5-4 / wildtype, FAT-switch S-nitrosoproteome",169,37277371,,,,-0.2415005,0.3342429,NO,,
QVTVDRPDVAGR,ph,T,428,false,"atm and atr DNA damage response",88,25561503,"MASCOT Score",30.0000000,1.0000000,,,,,0.3000000
QVTVDRPDVAGR,ph,T,428,false,"Tissue atlas Arabidopsis - ProteomicsDB",114,32188942,"MaxQuant score",71.3440000,1.0000000,,,,0.0015095600392669,
VKILQVHSR,ac,K,439,true,"Quantitative Acetylproteomics",101,29440448,,,,,,,,
DVDFDKVAR,ac,K,458,true,"Histone deacetylases - apicidin vs control",98a,29061669,"MaxQuant Score",77.7000000,1.0000000,-0.0630000,0.7112135,NO,0.0080000003799796,
DVDFDKVAR,ac,K,458,true,"Histone deacetylases substrates - hda14 vs WT",98e,29061669,"MaxQuant Score",88.5000000,1.0000000,0.1550000,0.8375293,NO,0.00069000001531094,
DVDFDKVAR,ac,K,458,true,"Quantitative Acetylproteomics",101,29440448,,,,,,,,
MNEAAILAAR,nt,M,475,false,"Stromal N-terminome",96,26371235,"MASCOT Score",50.8200000,,,,,,
ELKEISKDEISDALER,ac,K,488,false,"Histone deacetylases - hda14 vs WT (thylakoids)",98d,29061669,"MaxQuant Score",83.4000000,1.0000000,-0.9480000,0.8394600,NO,6.690000020626E-8,
ELKEISKDEISDALER,ac,K,488,false,"Histone deacetylases substrates - hda14 vs WT",98e,29061669,"MaxQuant Score",58.2000000,0.9960000,-0.0400000,0.9354057,NO,0.00044999999227002,
EISKDEISDALER,ac,K,492,false,"Histone deacetylases - apicidin vs control",98a,29061669,"MaxQuant Score",79.6000000,1.0000000,-0.1530000,0.3917419,NO,0.00073999998858199,
EISKDEISDALER,ac,K,492,false,"Histone deacetylases - hda14 vs WT (thylakoids)",98d,29061669,"MaxQuant Score",150.1000000,1.0000000,-0.2760000,0.8892011,NO,3.7599998670146E-9,
EISKDEISDALER,ac,K,492,false,"Histone deacetylases substrates - hda14 vs WT",98e,29061669,"MaxQuant Score",153.1000000,1.0000000,-0.0340000,0.9418896,NO,1.3000000556892E-37,
NAVVSEEKK,ac,K,517,false,"Quantitative Acetylproteomics",101,29440448,,,,,,,,
