Peptide,PTM,ModifiedAA,ModifiedPosition,PeptideUniqueToGene,ExperimentDesc,ExpID,PubmedID,ScoreType,IdentScore,LocProb,Log2FChange,PQ-val,QuantSig,PEP,MassErrorPPM
PGSEPSET,nt,P,50,true,"N-terminal ChaFRADIC",92,26010716,"MASCOT Score",24.2400000,,,,,0.039510000497103,
PGSEPSETQWPAK,ph,S,52,true,"Phospho cell culture sucrose/TOR",109,30833711,,,0.9999960,,,,,
ACNTQK,sno,C,124,true,"hot5-4 / wildtype, FAT-switch S-nitrosoproteome",169,37277371,,,,,,,,
ACNTQK,so,C,124,true,"S-sulfenylation site detection using YAP1C",110,32714340,,,,,,,,
LTSVLQNK,ph,S,302,true,"Tissue atlas Arabidopsis - ProteomicsDB",114,32188942,"MaxQuant score",129.8300000,0.9998700,,,,0.0029475900810212,
TLSFAIADGSRPGNEGR,ph,S,359,true,"Tissue atlas Arabidopsis - ProteomicsDB",114,32188942,"MaxQuant score",112.5500000,0.9997630,,,,1.5823899968126E-9,
ITDIIKEEEASFCK,sno,C,436,true,"Site-specific nitrosomeproteomic id - gsnor1-3",90a,25699590,XCorr,2.5596519,,,,,2.0190000213915E-5,-4.0449091
ITDIIKEEEASFCK,sno,C,436,true,"Site-specific nitrosomeproteomic id - gsnor1-3",90b,25699590,XCorr,4.8700000,,,,,0.013700000010431,-7.3400000
ITDIIKEEEASFCK,sno,C,436,true,"hot5-4 / wildtype, FAT-switch S-nitrosoproteome",169,37277371,,,,,,,,
KITDIIKEEEASFCK,so,C,436,true,"S-sulfenylation site detection using YAP1C",110,32714340,,,,,,,,
GLLVDVDGFNKAMEEAR,nt,G,485,true,"Metacaspase9 substrates - in vitro rMC9",51c,23964026,"MASCOT Score",102.0000000,,,,,,-1.0401187
AGVSATDDSFK,ph,S,532,true,"Tissue atlas Arabidopsis - ProteomicsDB",114,32188942,"MaxQuant score",117.8600000,0.9994180,,,,2.7178199161426E-5,
GSIVLPEKLR,ac,K,675,true,"Quantitative Acetylproteomics",101,29440448,,,,,,,,
FDFSHGKPVDPEDLR,ac,K,684,true,"Histone deacetylases substrates - hda14 vs WT",98e,29061669,"MaxQuant Score",45.6000000,1.0000000,0.0160000,0.9885531,NO,0.0020000000949949,
FDFSHGKPVDPEDLR,ub,K,684,true,"upl3 mutant / wildtype",168,35926874,"MaxQuant score",60.5500000,1.0000000,-0.0558912,,,0.00036343300598674,0.0257070
RIESIVNK,ph,S,696,true,"atm and atr DNA damage response",88,25561503,"MASCOT Score",47.0000000,1.0000000,,,,,-1.1600000
RIESIVNK,ph,S,696,true,"Tissue atlas Arabidopsis - ProteomicsDB",114,32188942,"MaxQuant score",74.9440000,1.0000000,,,,0.0085291303694248,
EAVLSEAKR,ph,S,716,true,"Tissue atlas Arabidopsis - ProteomicsDB",114,32188942,"MaxQuant score",71.1530000,1.0000000,,,,0.0062993098981678,
EAVLSEAKR,ac,K,719,true,"Quantitative Acetylproteomics",101,29440448,,,,,,,,
AFALLSEEGIAKGIR,ub,K,789,true,"upl3 mutant / wildtype",168,35926874,"MaxQuant score",117.7000000,1.0000000,-0.4679324,0.3411000,NO,4.1139198714291E-8,-0.1704400
VTAVTTECAFDALNAASLLER,so,C,801,true,"S-sulfenylation site detection using YAP1C",110,32714340,,,,,,,,
AEGSALEK,ph,S,825,true,"Tissue atlas Arabidopsis - ProteomicsDB",114,32188942,"MaxQuant score",74.8410000,1.0000000,,,,0.011268000118434,
AEGSALEKK,ac,K,829,true,"Quantitative Acetylproteomics",101,29440448,,,,,,,,
SRVDAAIIPAAKK,ac,K,847,true,"Quantitative Acetylproteomics",101,29440448,,,,,,,,
SVKLATEAAESAASDGK,ub,K,879,true,"upl3 mutant / wildtype",168,35926874,"MaxQuant score",73.9280000,1.0000000,0.5109619,,,0.00019073199655395,-0.4458200
TFCIIQLDVGLDAAAVR,so,C,896,true,"S-sulfenylation site detection using YAP1C",110,32714340,,,,,,,,
DVGLDAAAVR,nt,D,901,true,"Metacaspase9 substrates - in vitro rMC9",51c,23964026,"MASCOT Score",67.0000000,,2.0096966,,NO,,0.0943775
EAVSKVMEK,ac,K,915,true,"Quantitative Acetylproteomics",101,29440448,,,,,,,,
AVVCAGVPEK,sno,C,939,true,"Site-specific nitrosomeproteomic id - gsnor1-3",90a,25699590,XCorr,2.2665262,,,,,0.081649996340275,-6.6245259
AVVCAGVPEK,sno,C,939,true,"hot5-4 / wildtype, FAT-switch S-nitrosoproteome",169,37277371,,,,0.2604562,0.2570849,NO,,
AVVCAGVPEK,so,C,939,true,"Arabidopsis S-sulfenylation chemoproteomics",108,31578252,"pFind PSM Score",0.0373201,,1.1492700,,,,-1.1054883
AVVCAGVPEK,so,C,939,true,"S-sulfenylation site detection using YAP1C",110,32714340,,,,,,,,
QGTDASQVQAALD,nt,Q,980,true,"HUNTER N-terminome: legumain, GluC and trypsin",119,31951383,"MaxQuant score",138.2400000,,,,,,
