Peptide,PTM,ModifiedAA,ModifiedPosition,PeptideUniqueToGene,ExperimentDesc,ExpID,PubmedID,ScoreType,IdentScore,LocProb,Log2FChange,PQ-val,QuantSig,PEP,MassErrorPPM
RYPSPSPLLSR,ph,S,83,true,"atm and atr DNA damage response",88,25561503,"MASCOT Score",31.0000000,1.0000000,,,,,-0.2700000
RYPSPSPLLSR,ph,S,83,true,"Tissue atlas Arabidopsis - ProteomicsDB",114,32188942,"MaxQuant score",112.9500000,0.9921390,,,,2.3928399969009E-5,
SLDCGSDR,ph,S,217,true,"atm and atr DNA damage response",88,25561503,"MASCOT Score",33.0000000,1.0000000,,,,,0.2100000
LQDPGSPLSSSPGLK,ph,S,346,true,"Tissue atlas Arabidopsis - ProteomicsDB",114,32188942,"MaxQuant score",140.7800000,0.9999070,,,,2.9855999628126E-7,
FSSDAVPLSSPR,ph,S,378,true,"Tissue atlas Arabidopsis - ProteomicsDB",114,32188942,"MaxQuant score",127.3000000,0.8022660,,,,3.714680133271E-5,
SASPSKLWATTTSSPAR,ph,S,395,true,"Tissue atlas Arabidopsis - ProteomicsDB",114,32188942,"MaxQuant score",137.1300000,0.9769220,,,,6.2882998808078E-10,
LWATTTSSPAR,ph,T,403,true,"Chloroplast kinase substrates",60,19376835,"MASCOT Score",35.1000000,,,,,,3.6345200
VDEMNSVMVETVNVTAKEK,ph,T,608,true,"srk2dei ABA signaling phopshoproteomics",83,23572148,"MASCOT Score",27.0000000,,,,,,-0.0013000
