Peptide,PTM,ModifiedAA,ModifiedPosition,PeptideUniqueToGene,ExperimentDesc,ExpID,PubmedID,ScoreType,IdentScore,LocProb,Log2FChange,PQ-val,QuantSig,PEP,MassErrorPPM
AQIQHQGQNANGGVAVPGAAAAE,nt,A,2,true,"Arg/N-end rule seed, prt6 vs. Wt",99,29168982,"MASCOT Score",89.9000000,,-0.2539770,0.1436410,NO,3.5170000168872E-15,-2.4914575
AQIQHQGQNANGGVAVPGAAAAE,nt,A,2,true,"HUNTER N-terminome: legumain, GluC and trypsin",119,31951383,"MaxQuant score",96.3790000,,,,,,
AQIQHQGQNAN,nt,A,2,true,"Arg/N-end rule seed, prt6 vs. Wt",99,29168982,"MASCOT Score",54.3100000,,,,,0.027629999443889,-1.1300876
AQIQHQGQNANGGVAVPGAAAAE,nta,A,2,true,"Arg/N-end rule seed, prt6 vs. Wt",99,29168982,"MASCOT Score",89.9000000,,,,,3.5170000168872E-15,-2.4914575
AQIQHQGQNANGGVAVPGAAAAE,nta,A,2,true,"HUNTER N-terminome: legumain, GluC and trypsin",119,31951383,"MaxQuant score",168.8900000,,,,,,
AQIQHQGQNANGGVAVPGAAAAE,nta,A,2,true,"Arabidopsis translation initiation landscape - NTA",167a,35069635,,,,,,,,
AQIQHQGQNAN,nta,A,2,true,"Arg/N-end rule seed, prt6 vs. Wt",99,29168982,"MASCOT Score",54.3100000,,,,,0.027629999443889,-1.1300876
GGVAVPGAAAAE,nt,G,13,true,"Arg/N-end rule seed, prt6 vs. Wt",99,29168982,"MASCOT Score",31.1500000,,0.2470595,0.4273257,NO,0.0096580004319549,-0.4940387
SLGYGYVNYATPQDASR,nt,S,85,true,"Arabidopsis translation initiation landscape - NT",167b,35069635,,,,,,,,
KSGVGNIFIK,ub,K,129,true,"upl3 mutant / wildtype",168,35926874,"MaxQuant score",66.5600000,1.0000000,-0.0454314,0.9657600,NO,0.0032097799703479,-0.2129000
SGVGNIFIK,ph,S,130,true,"Tissue atlas Arabidopsis - ProteomicsDB",114,32188942,"MaxQuant score",74.8410000,1.0000000,,,,0.0065761301666498,
NLDKSIDHK,ac,K,142,true,"Quantitative Acetylproteomics",101,29440448,,,,,,,,
ALHETFSAFGPILSCK,ph,S,161,true,"Tissue atlas Arabidopsis - ProteomicsDB",114,32188942,"MaxQuant score",54.0080000,0.9999750,,,,0.0008051409968175,
ALHETFSAFGPILSCK,so,C,162,true,"S-sulfenylation site detection using YAP1C",110,32714340,,,,,,,,
LNGMLLNDK,mox,M,196,false,"cat2 Methionine oxidation - 1h stress",62a,25693801,"MASCOT Score",48.0000000,,0.2006551,,NO,,
LNGMLLNDK,mox,M,196,false,"cat2 Methionine oxidation - 3h stress",62b,25693801,"MASCOT Score",34.0000000,,0.2055501,,NO,,
LQRDPSGEKVK,ph,S,217,true,"Tissue atlas Arabidopsis - ProteomicsDB",114,32188942,"MaxQuant score",106.3300000,1.0000000,,,,1.373649956804E-5,
NLSESLSDEELNK,ph,S,236,true,"Tyrosine phosphorylation in Arabidopsis",59,18463617,"MASCOT Score",52.0000000,,,,,,-1.6060046
VFGEFGVTTSCVIMR,so,C,253,true,"S-sulfenylation site detection using YAP1C",110,32714340,,,,,,,,
DGEGKSKGFGFVNFENSDDAAR,ub,K,262,true,"Arabidopsis ubiquitination COFRADIC",40,26744219,"MaxQuant Score",70.1740000,0.7520000,,,,5.8410000347627E-23,0.0600000
ETELKQK,me1,K,310,true,"Arabidopsis protein methylome",123,31809900,"MaxQuant Score",52.6360000,1.0000000,,,,0.018000699579716,-0.2690300
ETELKQKFEQSLKEAADK,me2,K,310,true,"Arabidopsis protein methylome",123,31809900,"MaxQuant Score",179.8700000,1.0000000,,,,0,-2.6393000
ETELKQKFEQSLKEAADK,me2,K,312,true,"Arabidopsis protein methylome",123,31809900,"MaxQuant Score",179.8700000,1.0000000,,,,0,-2.6393000
ETELKQKFEQSLKEAADK,me2,K,318,true,"Arabidopsis protein methylome",123,31809900,"MaxQuant Score",179.8700000,1.0000000,,,,0,-2.6393000
FEQSLKEAADK,me2,K,318,true,"Arabidopsis protein methylome",123,31809900,"MaxQuant Score",211.3800000,1.0000000,,,,0,-0.8949000
SQGSNLYVKNLDESVTDDKLR,ac,K,332,true,"Quantitative Acetylproteomics",101,29440448,,,,,,,,
NLDESVTDDKLR,nt,N,333,true,"Metacaspase9 substrates - in vitro rMC9",51c,23964026,"MASCOT Score",78.0000000,,3.2527414,,NO,,-0.9068683
NLDESVTDDK,ph,S,337,true,"SIRK1 phosphorylation",86a,23820729,"MaxQuant Score",53.3810000,0.9820000,,,,1.4199999570847,3.2310000
NLDESVTDDKLR,ac,K,342,true,"Quantitative Acetylproteomics",101,29440448,,,,,,,,
EHFAPFGTITSCK,sno,C,356,true,"Site-specific nitrosomeproteomic id - gsnor1-3",90a,25699590,XCorr,2.7824767,,,,,0.00014000000373926,-4.1715621
EHFAPFGTITSCK,sno,C,356,true,"Site-specific nitrosomeproteomic id - gsnor1-3",90b,25699590,XCorr,2.0600000,,,,,0.0042929998598993,-5.5000000
NLDESVTDDKLREHFAPFGTITSCK,so,C,356,true,"S-sulfenylation site detection using YAP1C",110,32714340,,,,,,,,
EHFAPFGTITSCK,so,C,356,true,"Arabidopsis S-sulfenylation chemoproteomics",108,31578252,"pFind PSM Score",0.0019156,,1.2182900,,,,-0.7664490
GSGFVAFSTPEEATR,ph,S,369,true,"SIRK1 phosphorylation",86a,23820729,"MaxQuant Score",67.0420000,0.8150000,,,,1.1510000228882,3.7300000
MYRYPQR,me2,R,532,true,"Arabidopsis protein methylome",123,31809900,"MaxQuant Score",103.0200000,1.0000000,,,,7.1265199687656E-13,-0.1118700
DVNTMPGPTQNMLSVPYDVSSGGGVHHR,og,T,545,true,"O-GlcNac Inflorescence Tissue",81,28154133,"MASCOT Score",28.6000000,,,,,,2.3000000
DSPTSQPVPIVALATR,nt,D,565,true,"Metacaspase9 substrates - in vitro rMC9",51c,23964026,"MASCOT Score",55.0000000,,,,,,0.2324317
DSPTSQPVPIVALATR,ph,S,566,true,"atm and atr DNA damage response",88,25561503,"MASCOT Score",37.0000000,1.0000000,,,,,-0.6200000
DSPTSQPVPIVALATR,ph,S,566,true,"Tissue atlas Arabidopsis - ProteomicsDB",114,32188942,"MaxQuant score",197.7500000,0.9994380,,,,6.3202400971465E-36,
DSPTSQPVPIVALATR,ph,S,569,true,"atm and atr DNA damage response",88,25561503,"MASCOT Score",47.0000000,0.9520000,,,,,-0.4600000
LANAAPEQQR,nt,L,581,true,"Metacaspase9 substrates - in vitro rMC9",51c,23964026,"MASCOT Score",50.0000000,,1.9254460,,NO,,0.6000324
