Peptide,PTM,ModifiedAA,ModifiedPosition,PeptideUniqueToGene,ExperimentDesc,ExpID,PubmedID,ScoreType,IdentScore,LocProb,Log2FChange,PQ-val,QuantSig,PEP,MassErrorPPM
MEIKPGLSALVTGGASGIGRAL,nta,M,1,true,"Arabidopsis translation initiation landscape - NTA",167a,35069635,,,,,,,,
MEIKPGLSALVTGGASGIGR,nta,M,1,true,"Arg/N-end rule seed, prt6 vs. Wt",99,29168982,"MASCOT Score",48.5300000,,0.7605037,0.2650207,NO,0.0036390000022948,-3.5383891
KRPSFK,ph,S,274,false,"TOR Kinase and ABA Receptor",100,29290610,XCorr,2.6119618,1.0000000,,,,0.01642999984324,
YFTGGSPK,ph,S,345,true,"Tissue atlas Arabidopsis - ProteomicsDB",114,32188942,"MaxQuant score",98.0480000,0.9990350,,,,0.0054490300826728,
VIATCGGSEK,ox,C,459,true,"OxiTRAQ Arabidopsis - 5 mM H2O2 versus control",47,24376095,,,,0.1187337,0.3489613,NO,,
VIATCGGSEK,sno,C,459,true,"hot5-4 / wildtype, FAT-switch S-nitrosoproteome",169,37277371,,,,,,,,
VIATCGGSEK,so,C,459,true,"Arabidopsis S-sulfenylation chemoproteomics",108,31578252,"pFind PSM Score",0.2965410,,1.2987000,,,,0.4448114
VIDYKSENIK,ac,K,480,true,"Quantitative Acetylproteomics",101,29440448,,,,,,,,
VVVCIDPAFEQK,ox,C,617,true,"SPEAR - 10 mM H2O2 / mock",138a,34619326,,,,3.9105991,0.0024126,YES,,
VVVCIDPAFEQK,ox,C,617,true,"SPEAR - 50 mM H2O2 / mock",138b,34619326,,,,3.9717041,0.0003932,YES,,
VVVCIDPAFEQK,sno,C,617,true,"Site-specific nitrosomeproteomic id - gsnor1-3",90a,25699590,XCorr,2.1933851,,,,,0.00072549999458715,-4.2175907
VVVCIDPAFEQK,sno,C,617,true,"Site-specific nitrosomeproteomic id - gsnor1-3",90b,25699590,XCorr,2.0000000,,,,,0.14169999957085,-6.1200000
