Peptide,PTM,ModifiedAA,ModifiedPosition,PeptideUniqueToGene,ExperimentDesc,ExpID,PubmedID,ScoreType,IdentScore,LocProb,Log2FChange,PQ-val,QuantSig,PEP,MassErrorPPM
GGCTSK,myr,G,2,false,"N-Terminal Myristoylated Proteins",102,29453228,,,,,,,,
SPIPTPSAAK,ph,S,38,true,"Tissue atlas Arabidopsis - ProteomicsDB",114,32188942,"MaxQuant score",79.2010000,0.9999650,,,,0.0031924699433148,
ASPFFPFYTPSPAR,ph,T,56,false,"Brassinosteroid-Regulated Phosphorylation Dynamics",94,26187819,"MaxQuant Score",129.1100000,1.0000000,,,,0.00019299999985378,1.1090000
ASPFFPFYTPSPAR,ph,T,56,false,"TOR Kinase and ABA Receptor",100,29290610,XCorr,3.8520634,0.9971000,,,,2.8829999791924E-6,
ASPFFPFYTPSPAR,ph,S,58,false,"Brassinosteroid-Regulated Phosphorylation Dynamics",94,26187819,"MaxQuant Score",129.1100000,1.0000000,,,,0.00019299999985378,-1.2790000
ASPFFPFYTPSPAR,ph,S,58,false,"TOR Kinase and ABA Receptor",100,29290610,XCorr,4.4080172,0.9998000,,,,5.1719998737099E-6,
SRDVGGGGESK,ph,S,67,true,"atm and atr DNA damage response",88,25561503,"MASCOT Score",27.0000000,1.0000000,,,,,-0.3600000
SLTSTPLR,ph,S,78,true,"atm and atr DNA damage response",88,25561503,"MASCOT Score",33.0000000,1.0000000,,,,,0.6600000
SLTSTPLR,ph,S,78,true,"Tissue atlas Arabidopsis - ProteomicsDB",114,32188942,"MaxQuant score",125.8200000,0.9981580,,,,0.0029583799187094,
SLTSTPLR,ph,T,80,true,"atm and atr DNA damage response",88,25561503,"MASCOT Score",28.0000000,0.9860000,,,,,-0.4400000
SLTSTPLR,ph,T,80,true,"Tissue atlas Arabidopsis - ProteomicsDB",114,32188942,"MaxQuant score",143.0400000,0.8809670,,,,0.0058097001165152,
RAFHPPSPAK,ph,S,95,true,"Tissue atlas Arabidopsis - ProteomicsDB",114,32188942,"MaxQuant score",150.0400000,1.0000000,,,,0.00011762799840653,
AFHPPSPAK,ph,S,95,true,"atm and atr DNA damage response",88,25561503,"MASCOT Score",40.0000000,1.0000000,,,,,0.3100000
AFHPPSPAK,ph,S,95,true,"TOR Kinase and ABA Receptor",100,29290610,XCorr,2.6271365,1.0000000,,,,0.0024719999637455,
LNDIVGSAYYVAPEVLHR,ph,S,318,false,"Tissue atlas Arabidopsis - ProteomicsDB",114,32188942,"MaxQuant score",54.9850000,0.9838700,,,,0.00049012998351827,
DIVGSAYYVAPEVLHR,ph,S,318,false,"Tissue atlas Arabidopsis - ProteomicsDB",114,32188942,"MaxQuant score",153.2400000,1.0000000,,,,7.4156701612704E-11,
TESGIFR,ph,S,360,false,"Arabidopsis root NAA phosphoproteome",18a,27643528,"MaxQuant Score",53.9680000,0.9990000,,,,0.0080000003799796,-0.8510000
TESGIFR,ph,S,360,false,"Phosphorylation Early Elicitor Signaling",23,17317660,,,,,,,,
TESGIFR,ph,S,360,false,"Plasmembrane Ph Immune Responses",25,17651370,,,,,,,,
TESGIFR,ph,S,360,false,"srk2dei ABA signaling phopshoproteomics",83,23572148,"MASCOT Score",47.0000000,,,,,,-0.0001000
TESGIFR,ph,S,360,false,"Phospho cell culture sucrose/TOR",109,30833711,,,0.9999660,,,,,
TESGIFR,ph,S,360,false,"Tissue atlas Arabidopsis - ProteomicsDB",114,32188942,"MaxQuant score",194.2900000,1.0000000,,,,6.5661898140945E-9,
DGLITMDTIRMALASNATEAMK,ph,T,489,true,"Brassinosteroid-Regulated Phosphorylation Dynamics",94,26187819,"MaxQuant Score",58.0240000,0.9920000,,,,0.035000000149012,0.7810000
