Peptide,PTM,ModifiedAA,ModifiedPosition,PeptideUniqueToGene,ExperimentDesc,ExpID,PubmedID,ScoreType,IdentScore,LocProb,Log2FChange,PQ-val,QuantSig,PEP,MassErrorPPM
MQMDSAQNQFNKR,nta,M,1,true,"Arabidopsis translation initiation landscape - NTA",167a,35069635,,,,,,,,
MDSAQNQFNKR,nt,M,3,true,"N-terminal ChaFRADIC",92,26010716,"MASCOT Score",24.8800000,,,,,0.00045140000293031,
MDSAQNQFNKR,nta,M,3,true,"Arg/N-end rule pathway Roots",80,25728785,"MASCOT Score",48.7500000,,,,,0.00011990000348305,
MDSAQNQFNKR,nta,M,3,true,"N-terminal ChaFRADIC",92,26010716,"MASCOT Score",24.8800000,,,,,0.00045140000293031,
MDSAQNQFNKR,nta,M,3,true,"Arabidopsis translation initiation landscape - NTA",167a,35069635,,,,,,,,
VIYPSNPESTEPVNK,ph,S,35,true,"Tissue atlas Arabidopsis - ProteomicsDB",114,32188942,"MaxQuant score",99.0550000,0.8518880,,,,2.4657900212333E-5,
AEETPKVLK,ac,K,63,true,"Histone deacetylases - apicidin vs control",98a,29061669,"MaxQuant Score",94.3000000,1.0000000,1.1060000,0.0100925,YES,0.0049999998882413,
KNPNPEEVNSSTPGGDDSENR,ph,T,84,true,"TOR Kinase and ABA Receptor",100,29290610,XCorr,5.5166774,0.9995000,,,,1.4239999804322E-11,
KNPNPEEVNSSTPGGDDSENR,ph,T,84,true,"Phospho cell culture sucrose/TOR",109,30833711,,,0.9613120,,,,,
KNPNPEEVNSSTPGGDDSENR,ph,T,84,true,"Tissue atlas Arabidopsis - ProteomicsDB",114,32188942,"MaxQuant score",231.9300000,0.9968760,,,,0,
NPNPEEVNSSTPGGDDSENR,ph,T,84,true,"atm and atr DNA damage response",88,25561503,"MASCOT Score",63.0000000,0.9980000,,,,,-0.4500000
NPNPEEVNSSTPGGDDSENR,ph,T,84,true,"TOR Kinase and ABA Receptor",100,29290610,XCorr,5.5904450,0.8142000,,,,1.2760000001055E-10,
NPNPEEVNSSTPGGDDSENR,ph,T,84,true,"Lateral root-induction - NAA vs control",106,23328941,"MASCOT Score",75.0000000,,,,,,
NPNPEEVNSSTPGGDDSENR,ph,S,90,true,"atm and atr DNA damage response",88,25561503,"MASCOT Score",25.0000000,1.0000000,,,,,-0.4500000
NPNPEEVNSSTPGGDDSENR,ph,S,90,true,"Tissue atlas Arabidopsis - ProteomicsDB",114,32188942,"MaxQuant score",116.2700000,0.9979340,,,,3.5014599726602E-12,
FYESASAR,ph,S,101,false,"Tissue atlas Arabidopsis - ProteomicsDB",114,32188942,"MaxQuant score",104.2200000,0.9450480,,,,0.0044228099286556,
