Peptide,PTM,ModifiedAA,ModifiedPosition,PeptideUniqueToGene,ExperimentDesc,ExpID,PubmedID,ScoreType,IdentScore,LocProb,Log2FChange,PQ-val,QuantSig,PEP,MassErrorPPM
SLAADNVLLVEEGRPATAEHPSAGPVYR,nt,S,2,true,"Arg/N-end rule seed, prt6 vs. Wt",99,29168982,"MASCOT Score",51.7600000,,,,,0.0005708999815397,-0.1203988
SLAADNVLLVEEGR,nt,S,2,true,"Arg/N-end rule seed, prt6 vs. Wt",99,29168982,"MASCOT Score",39.6200000,,,,,0.041629999876022,-0.2915176
SLAADNVLLVEEGRPATAEHPSAGPVYR,nta,S,2,true,"Arg/N-end rule pathway Roots",80,25728785,"MASCOT Score",57.5400000,,,,,6.1750000668326E-7,
SLAADNVLLVEEGRPATAEHPSAGPVYR,nta,S,2,true,"Arg/N-end rule seed, prt6 vs. Wt",99,29168982,"MASCOT Score",51.7600000,,,,,0.0005708999815397,-0.1203988
SLAADNVLLVEEGRPATAEHPSAGPVYR,nta,S,2,true,"HUNTER N-terminome: legumain, GluC and trypsin",119,31951383,"MaxQuant score",142.8700000,,,,,,
SLAADNVLLVEEGR,nta,S,2,true,"Arg/N-end rule seed, prt6 vs. Wt",99,29168982,"MASCOT Score",39.6200000,,,,,0.041629999876022,-0.2915176
SLAADNVLLVEEGRPATAEHPSAGPVYR,ph,S,2,true,"Tissue atlas Arabidopsis - ProteomicsDB",114,32188942,"MaxQuant score",178.0700000,1.0000000,,,,0,
SLAADNVLLVEEGRPATAEHPSAGPVYR,ph,T,18,true,"Tissue atlas Arabidopsis - ProteomicsDB",114,32188942,"MaxQuant score",245.4100000,0.9997580,,,,0,
LNYQSPNDFESLCQNLKAQK,ub,K,593,true,"upl3 mutant / wildtype",168,35926874,"MaxQuant score",101.5400000,1.0000000,1.2320467,,,7.7745102022853E-11,0.0944330
