Peptide,PTM,ModifiedAA,ModifiedPosition,PeptideUniqueToGene,ExperimentDesc,ExpID,PubmedID,ScoreType,IdentScore,LocProb,Log2FChange,PQ-val,QuantSig,PEP,MassErrorPPM
ADADDIQPIVCDNGTGMVKAGFAGDDAPR,nt,A,2,true,"N-terminal ChaFRADIC",92,26010716,"MASCOT Score",36.5900000,,,,,3.1609999950888E-6,
ADADDIQPIVCDNGTGMVKAGFAGDDAPR,nt,A,2,true,"Arg/N-end rule seed, prt6 vs. Wt",99,29168982,"MASCOT Score",49.7300000,,,,,3.1799998396309E-5,0.0684888
ADADDIQPIVCDNGTGMVKAGFAGDDAPR,nt,A,2,true,"FtsH12 N-terminome: WT / FtsH12 knockdown miRNA",118,33216923,"MaxQuant score",45.6790000,,,,,0.020037999376655,
ADADDIQPIVCDNGTGMVKAGF,nt,A,2,true,"Arg/N-end rule seed, prt6 vs. Wt",99,29168982,"MASCOT Score",55.3800000,,,,,0.00041690000216477,-1.0609854
ADADDIQPIVCDNGTGM,nt,A,2,true,"Arg/N-end rule seed, prt6 vs. Wt",99,29168982,"MASCOT Score",34.6900000,,,,,0.028759999200702,-1.3821327
ADADDIQPIVCD,nt,A,2,true,"Arg/N-end rule seed, prt6 vs. Wt",99,29168982,"MASCOT Score",29.0100000,,,,,0.0004907000111416,-3.1799822
ADADDIQPIV,nt,A,2,true,"N-term acetylation drought responses",5,26184543,,,,,,,,
ADADDIQPI,nt,A,2,true,"Arg/N-end rule seed, prt6 vs. Wt",99,29168982,"MASCOT Score",41.0800000,,0.0203783,0.9500771,NO,0.17980000376701,-0.8830913
ADADDIQPIVCDNGTGMVKAGFAGDDAPR,nta,A,2,true,"Arg/N-end rule pathway Roots",80,25728785,"MASCOT Score",35.0200000,,,,,0.00057129998458549,
ADADDIQPIVCDNGTGMVKAGFAGDDAPR,nta,A,2,true,"N-terminal ChaFRADIC",92,26010716,"MASCOT Score",36.5900000,,,,,3.1609999950888E-6,
ADADDIQPIVCDNGTGMVKAGFAGDDAPR,nta,A,2,true,"Arg/N-end rule seed, prt6 vs. Wt",99,29168982,"MASCOT Score",49.7300000,,-0.9099909,0.7549598,NO,3.1799998396309E-5,0.0684888
ADADDIQPIVCDNGTGMVKAGFAGDDAPR,nta,A,2,true,"HUNTER N-terminome: legumain, GluC and trypsin",119,31951383,"MaxQuant score",98.8400000,,,,,,
ADADDIQPIVCDNGTGMVKAGFAGDDAPR,nta,A,2,true,"Arabidopsis translation initiation landscape - NTA",167a,35069635,,,,,,,,
ADADDIQPIVCDNGTGMVKAGF,nta,A,2,true,"Arg/N-end rule seed, prt6 vs. Wt",99,29168982,"MASCOT Score",55.3800000,,-0.1781912,0.7367062,NO,0.00041690000216477,-1.0609854
ADADDIQPIVCDNGTGMVK,nta,A,2,true,"Arg/N-end rule pathway Roots",80,25728785,"MASCOT Score",33.1000000,,,,,0.070900000631809,
ADADDIQPIVCDNGTGM,nta,A,2,true,"Arg/N-end rule seed, prt6 vs. Wt",99,29168982,"MASCOT Score",34.6900000,,,,,0.028759999200702,-1.3821327
ADADDIQPIVCD,nta,A,2,true,"Arg/N-end rule seed, prt6 vs. Wt",99,29168982,"MASCOT Score",29.0100000,,,,,0.0004907000111416,-3.1799822
ADADDIQPIV,nta,A,2,true,"N-term acetylation drought responses",5,26184543,,,,,,,,
AGFAGDDAPR,nt,A,21,false,"Arg/N-end rule seed, prt6 vs. Wt",99,29168982,"MASCOT Score",49.2300000,,,,,0.0097279995679855,-0.6321017
HHGVMVGMNQK,ac,K,52,false,"Quantitative Acetylproteomics",101,29440448,,,,,,,,
KDAYVGDEAQSKR,nt,K,52,false,"Metacaspase9 substrates - Col-0 / mc9",51a,23964026,"MASCOT Score",97.0000000,,1.0929999,,NO,,-1.4218983
DAYVGDEAQSKR,nt,D,53,false,"Metacaspase9 substrates - Col-0 / mc9",51a,23964026,"MASCOT Score",58.0000000,,1.4443579,,NO,,-1.1442161
DAYVGDEAQSKR,nt,D,53,false,"Metacaspase9 substrates - 35S:MC9 / mc9",51b,23964026,"MASCOT Score",80.0000000,,2.0040840,,NO,,-1.0150866
DAYVGDEAQSKR,nt,D,53,false,"Metacaspase9 substrates - in vitro rMC9",51c,23964026,"MASCOT Score",74.0000000,,2.5033535,,NO,,-0.2692275
AQSKRGILTLKYPIE,nt,A,60,false,"Arabidopsis translation initiation landscape - NT",167b,35069635,,,,,,,,
DAYVGDEAQSKR,ph,S,62,false,"atm and atr DNA damage response",88,25561503,"MASCOT Score",45.0000000,1.0000000,,,,,-2.4800000
DAYVGDEAQSKR,ph,S,62,false,"Tissue atlas Arabidopsis - ProteomicsDB",114,32188942,"MaxQuant score",118.1600000,1.0000000,,,,6.4769803429954E-5,
DAYVGDEAQSKR,ac,K,63,false,"Quantitative Acetylproteomics",101,29440448,,,,,,,,
DAYVGDEAQSKR,ub,K,63,false,"upl3 mutant / wildtype",168,35926874,"MaxQuant score",142.1000000,1.0000000,-0.1392358,0.9123400,NO,1.2929699977349E-8,0.6924400
IAPEEHPVLLTEAPLNPKANR,ub,K,115,false,"upl3 mutant / wildtype",168,35926874,"MaxQuant score",91.5890000,1.0000000,0.1492594,,,7.887140185403E-8,-1.3277000
TTGIVLDSGDGVSH,nt,T,150,false,"Arg/N-end rule seed, prt6 vs. Wt",99,29168982,"MASCOT Score",76.9100000,,,,,0.0049939998425543,-3.6660702
SGDGVSHTVPIYE,nt,S,157,false,"Arg/N-end rule seed, prt6 vs. Wt",99,29168982,"MASCOT Score",51.8200000,,,,,5.9660000260919E-5,-3.2780340
GYMFTTTAER,ph,T,205,false,"Tissue atlas Arabidopsis - ProteomicsDB",114,32188942,"MaxQuant score",74.9620000,0.8158470,,,,0.0035898699425161,
LSFVAVDYEQEMETSKTSSSIEK,ub,K,233,false,"upl3 mutant / wildtype",168,35926874,"MaxQuant score",175.8500000,1.0000000,0.2582174,0.6888200,NO,4.7971098672276E-32,0.6514100
TSSSIEKNYELPDGQVITIGAER,ub,K,240,false,"upl3 mutant / wildtype",168,35926874,"MaxQuant score",55.7440000,1.0000000,-0.3584540,,,2.1685400497518E-5,0.4203700
NYELPDGQVITIGAER,nt,N,241,false,"Metacaspase9 substrates - Col-0 / mc9",51a,23964026,"MASCOT Score",54.0000000,,2.8753289,,NO,,-3.0303840
NYELPDGQVITIGAER,nt,N,241,false,"Metacaspase9 substrates - 35S:MC9 / mc9",51b,23964026,"MASCOT Score",57.0000000,,4.0989103,,NO,,-3.1386117
TTYNSIMKCDVDIRKD,nt,T,279,false,"Arabidopsis translation initiation landscape - NT",167b,35069635,,,,,,,,
TTYNSIMKCD,nt,T,279,false,"Arg/N-end rule seed, prt6 vs. Wt",99,29168982,"MASCOT Score",27.1400000,,,,,0.00035710001247935,-1.9915902
SIMKCDVDIRKD,nt,S,283,false,"Arabidopsis translation initiation landscape - NT",167b,35069635,,,,,,,,
CDVDIR,ox,C,287,false,"OxiTRAQ Arabidopsis - 5 mM H2O2 versus control",47,24376095,,,,-0.2564682,0.0913252,NO,,
CDVDIR,sno,C,287,false,"Cold stress nitrosylation - 4°C vs 22°C",65,24388526,,,,,,,,
CDVDIR,sno,C,287,false,"hot5-4 / wildtype, FAT-switch S-nitrosoproteome",169,37277371,,,,,,,,
CDVDIRK,so,C,287,false,"S-sulfenylation site detection using YAP1C",110,32714340,,,,,,,,
MSKEITALAPSSMK,ub,K,317,false,"upl3 mutant / wildtype",168,35926874,"MaxQuant score",83.5400000,1.0000000,-0.5145732,0.4364200,NO,0.00010967499838443,-1.7227000
EITALAPSSMK,ph,S,325,false,"atm and atr DNA damage response",88,25561503,"MASCOT Score",53.0000000,0.9620000,,,,,0.1200000
EITALAPSSMK,ph,S,325,false,"Phospho cell culture sucrose/TOR",109,30833711,,,0.7807390,,,,,
EITALAPSSMK,ph,S,325,false,"Tissue atlas Arabidopsis - ProteomicsDB",114,32188942,"MaxQuant score",130.7700000,0.8321070,,,,1.1225499747525E-6,
EITALAPSSMK,ph,S,326,false,"atm and atr DNA damage response",88,25561503,"MASCOT Score",38.0000000,0.9620000,,,,,-0.8100000
EITALAPSSMK,ph,S,326,false,"Tissue atlas Arabidopsis - ProteomicsDB",114,32188942,"MaxQuant score",180.2400000,0.8310520,,,,1.5202200053812E-14,
EITALAPSSMK,mox,M,327,false,"cat2 Methionine oxidation - 1h stress",62a,25693801,"MASCOT Score",94.0000000,,0.4525829,,NO,,
EITALAPSSMK,mox,M,327,false,"cat2 Methionine oxidation - 3h stress",62b,25693801,"MASCOT Score",47.0000000,,-0.1391666,,NO,,
EITALAPSSMKIK,ac,K,328,false,"Quantitative Acetylproteomics",101,29440448,,,,,,,,
EITALAPSSMKIK,cr,K,328,false,"Open search Plant PTM Viewer 2.0 - Crotonylation",164c,TBA,,,,,,,,
EITALAPSSMKIK,ub,K,328,false,"upl3 mutant / wildtype",168,35926874,"MaxQuant score",112.4400000,1.0000000,0.8551924,0.3769400,NO,1.2826700185542E-5,-2.1161000
IKVVAPPER,ub,K,330,false,"upl3 mutant / wildtype",168,35926874,"MaxQuant score",66.0560000,1.0000000,0.9825829,0.1499390,NO,0.010741700418293,-0.2544700
