Peptide,PTM,ModifiedAA,ModifiedPosition,PeptideUniqueToGene,ExperimentDesc,ExpID,PubmedID,ScoreType,IdentScore,LocProb,Log2FChange,PQ-val,QuantSig,PEP,MassErrorPPM
GFGNSVEQCPK,sno,C,353,true,"hot5-4 / wildtype, FAT-switch S-nitrosoproteome",169,37277371,,,,0.3778567,0.0038936,NO,,
QILAAASGALESNGRHPPSSPPGK,ph,S,513,true,"Tissue atlas Arabidopsis - ProteomicsDB",114,32188942,"MaxQuant score",124.1300000,0.8131760,,,,2.429229942673E-27,
QILAAASGALESNGRHPPSSPPGK,ph,S,521,true,"TOR Kinase and ABA Receptor",100,29290610,XCorr,2.3361075,0.7657000,,,,0.0020119999535382,
HPPSSPPGK,ph,S,521,true,"atm and atr DNA damage response",88,25561503,"MASCOT Score",27.0000000,1.0000000,,,,,-1.2100000
HPPSSPPGK,ph,S,521,true,"TOR Kinase and ABA Receptor",100,29290610,XCorr,2.6648805,0.9294000,,,,0.004143999889493,
HPPSSPPGK,ph,S,521,true,"Phospho cell culture sucrose/TOR",109,30833711,,,0.9548830,,,,,
HPPSSPPGK,ph,S,521,true,"Tissue atlas Arabidopsis - ProteomicsDB",114,32188942,"MaxQuant score",153.6600000,0.9774460,,,,2.4523600931048E-21,
EDNFSSMER,ph,S,533,true,"Tissue atlas Arabidopsis - ProteomicsDB",114,32188942,"MaxQuant score",85.9580000,0.9084740,,,,0.0030141700990498,
EDNFSSMER,ph,S,534,true,"Tissue atlas Arabidopsis - ProteomicsDB",114,32188942,"MaxQuant score",71.8960000,0.9113620,,,,0.0022859300952405,
QQAISAGLPSPR,ph,S,765,true,"Tissue atlas Arabidopsis - ProteomicsDB",114,32188942,"MaxQuant score",139.7700000,0.8418130,,,,9.8463697213447E-6,
QQAISAGLPSPRPK,ph,S,770,true,"Large-scale phosphorylation discovery",44,23111157,XCorr,2.6020000,,,,,,
QQAISAGLPSPRPK,ph,S,770,true,"srk2dei ABA signaling phopshoproteomics",83,23572148,"MASCOT Score",46.0000000,,,,,,0.0003000
QQAISAGLPSPRPK,ph,S,770,true,"atm and atr DNA damage response",88,25561503,"MASCOT Score",44.0000000,1.0000000,,,,,-1.3000000
QQAISAGLPSPRPK,ph,S,770,true,"TOR Kinase and ABA Receptor",100,29290610,XCorr,3.0189152,1.0000000,,,,1.8400000044494E-5,
QQAISAGLPSPRPK,ph,S,770,true,"Phospho cell culture sucrose/TOR",109,30833711,,,0.9997210,,,,,
QQAISAGLPSPRPK,ph,S,770,true,"Tissue atlas Arabidopsis - ProteomicsDB",114,32188942,"MaxQuant score",276.1000000,1.0000000,,,,0,
QQAISAGLPSPR,ph,S,770,true,"atm and atr DNA damage response",88,25561503,"MASCOT Score",44.0000000,1.0000000,,,,,-0.0900000
GHDSQVSCVK,so,C,944,true,"Arabidopsis S-sulfenylation chemoproteomics",108,31578252,"pFind PSM Score",0.3037430,,1.6393400,,,,0.3715433
