Peptide,PTM,ModifiedAA,ModifiedPosition,PeptideUniqueToGene,ExperimentDesc,ExpID,PubmedID,ScoreType,IdentScore,LocProb,Log2FChange,PQ-val,QuantSig,PEP,MassErrorPPM
MDPSLSATNDPHHPPPPQF,nta,M,1,true,"Arg/N-end rule seed, prt6 vs. Wt",99,29168982,"MASCOT Score",28.2800000,,,,,0.076990000903606,-2.8911767
MDPSLSATN,nta,M,1,true,"HUNTER N-terminome: legumain, GluC and trypsin",119,31951383,"MaxQuant score",111.9500000,,,,,,
LASTPPPPPPTSVAPSLEPPR,ph,S,143,true,"Tissue atlas Arabidopsis - ProteomicsDB",114,32188942,"MaxQuant score",289.6100000,0.9170300,,,,0,
SDFIVNENQPLPDPVLASSTPQTIKR,ph,T,181,true,"Tissue atlas Arabidopsis - ProteomicsDB",114,32188942,"MaxQuant score",210.5100000,0.7728420,,,,0,
SDFIVNENQPLPDPVLASSTPQTIK,ph,T,181,true,"Large-scale phosphorylation discovery",44,23111157,XCorr,5.1910000,,,,,,
SDFIVNENQPLPDPVLASSTPQTIKR,ph,T,184,true,"Tissue atlas Arabidopsis - ProteomicsDB",114,32188942,"MaxQuant score",192.8900000,0.9882120,,,,0,
SDFIVNENQPLPDPVLASSTPQTIKR,ub,K,186,true,"Arabidopsis ubiquitination COFRADIC",40,26744219,"MaxQuant Score",62.0320000,1.0000000,,,,7.7939999777708E-25,-0.4750000
AKPDVVQPQPLTNGK,ph,T,206,true,"Tissue atlas Arabidopsis - ProteomicsDB",114,32188942,"MaxQuant score",87.6690000,1.0000000,,,,0.00069848902057856,
KDGTSPTVKPAASVSGGVETVKR,ub,K,249,true,"Arabidopsis ubiquitination COFRADIC",40,26744219,"MaxQuant Score",67.8270000,0.9930000,,,,2.5600000431677E-14,-0.0180000
KDGTSPTVKPAASVSGGVETVK,ph,S,253,true,"Large-scale phosphorylation discovery",44,23111157,XCorr,4.7280000,,,,,,
KDGTSPTVKPAASVSGGVETVK,ph,S,253,true,"Phosphoproteome ethylene-regulated time response",46,24043427,"MASCOT Score",78.9900000,,,,,,-12.1150000
KDGTSPTVKPAASVSGGVETVK,ph,S,253,true,"Phospho cell culture sucrose/TOR",109,30833711,,,0.8506230,,,,,
KDGTSPTVKPAASVSGGVETVK,ph,S,253,true,"Col-0 callus - FC Col-0 vs. Col-0 Xray",111a,31410901,,49.8500000,,-0.4803142,0.0000000,NO,,0.9428103
KDGTSPTVKPAASVSGGVETVK,ph,S,253,true,"Col-0 X-ray callus - FC Col-0 vs. Col-0 Xray",111b,31410901,,49.8500000,,-0.4803142,0.0000000,NO,,0.9428103
KDGTSPTVKPAASVSGGVETVK,ph,S,253,true,"atm callus - FC atm vs. atm Xray",111c,31410901,,49.8500000,,-0.0213329,0.0000000,NO,,0.9428103
KDGTSPTVKPAASVSGGVETVK,ph,S,253,true,"atm-3 X-ray callus - FC atm vs. atm Xray",111d,31410901,,49.8500000,,-0.0213329,0.0000000,NO,,0.9428103
KDGTSPTVKPAASVSGGVETVK,ph,S,253,true,"Tissue atlas Arabidopsis - ProteomicsDB",114,32188942,"MaxQuant score",265.7800000,0.9755400,,,,0,
KDGTSPTVKPAASVSGGVETVK,ph,T,255,true,"Large-scale phosphorylation discovery",44,23111157,XCorr,3.8890000,,,,,,
KDGTSPTVKPAASVSGGVETVK,ph,T,255,true,"LAXIC - mannitol vs control",84b,23660473,XCorr,3.2600000,0.7840000,,,,7.5099999393628E-15,
KDGTSPTVKPAASVSGGVETVK,ph,T,255,true,"SnRK2 protein kinase substrates",85,23776212,XCorr,2.8590028,0.8910000,,,,4.160019943658E-16,
KDGTSPTVKPAASVSGGVETVK,ph,S,261,true,"Tissue atlas Arabidopsis - ProteomicsDB",114,32188942,"MaxQuant score",170.7700000,0.9981950,,,,5.6051938572993E-45,
KDGTSPTVKPAASVSGGVETVK,ph,S,263,true,"Tissue atlas Arabidopsis - ProteomicsDB",114,32188942,"MaxQuant score",193.9400000,0.9995550,,,,0,
KDGTSPTVKPAASVSGGVETVK,ph,T,268,true,"Tissue atlas Arabidopsis - ProteomicsDB",114,32188942,"MaxQuant score",94.8860000,0.9996890,,,,2.6911799455576E-9,
KDGTSPTVKPAASVSGGVETVKR,ac,K,270,true,"Quantitative Acetylproteomics",101,29440448,,,,,,,,
RVDAGGASSVAPPPPPPTNVESGGEEVAVK,ph,T,330,true,"Brassinosteroid-Regulated Phosphorylation Dynamics",94,26187819,"MaxQuant Score",73.3410000,0.8890000,,,,0.00042269998812117,2.0410000
RVDAGGASSVAPPPPPPTNVESGGEEVAVK,ph,T,330,true,"Tissue atlas Arabidopsis - ProteomicsDB",114,32188942,"MaxQuant score",137.5700000,0.8122960,,,,0,
RVDAGGASSVAPPPPPPTNVESGGEEVAVKK,ph,S,334,true,"Arabidopsis root NAA phosphoproteome",18a,27643528,"MaxQuant Score",54.2820000,0.8290000,,,,6.7850000959879E-6,0.1640000
RVDAGGASSVAPPPPPPTNVESGGEEVAVKK,ph,S,334,true,"Phospho cell culture sucrose/TOR",109,30833711,,,0.7889750,,,,,
RVDAGGASSVAPPPPPPTNVESGGEEVAVKK,ph,S,334,true,"Tissue atlas Arabidopsis - ProteomicsDB",114,32188942,"MaxQuant score",130.6400000,0.9895410,,,,0,
RVDAGGASSVAPPPPPPTNVESGGEEVAVK,ph,S,334,true,"Large-scale phosphorylation discovery",44,23111157,XCorr,6.9280000,,,,,,
RVDAGGASSVAPPPPPPTNVESGGEEVAVK,ph,S,334,true,"SnRK2 protein kinase substrates",85,23776212,XCorr,4.7673821,0.9960000,,,,0.00042378800571896,
RVDAGGASSVAPPPPPPTNVESGGEEVAVK,ph,S,334,true,"Protein sumoylation and phosphorylation cross-talk",97,28419593,,,,,,,,
RVDAGGASSVAPPPPPPTNVESGGEEVAVK,ph,S,334,true,"TOR Kinase and ABA Receptor",100,29290610,XCorr,6.1619220,0.8832000,,,,1.8099999721244E-8,
VDAGGASSVAPPPPPPTNVESGGEEVAVKKR,ub,K,343,true,"Arabidopsis ubiquitination COFRADIC",40,26744219,"MaxQuant Score",79.5120000,0.8250000,,,,0,0.3030000
TGKPVGR,me1,K,371,true,"Arabidopsis protein methylome",123,31809900,"MaxQuant Score",81.2960000,1.0000000,,,,0.017814099788666,-0.5353500
KNAVSVGASGR,ub,K,378,true,"Arabidopsis ubiquitination COFRADIC",40,26744219,"MaxQuant Score",63.4730000,1.0000000,,,,0.0070000002160668,0.0008588
KNAVSVGASGR,ph,S,382,true,"Tissue atlas Arabidopsis - ProteomicsDB",114,32188942,"MaxQuant score",66.6600000,0.9812030,,,,0.0039530801586807,
