Peptide,PTM,ModifiedAA,ModifiedPosition,PeptideUniqueToGene,ExperimentDesc,ExpID,PubmedID,ScoreType,IdentScore,LocProb,Log2FChange,PQ-val,QuantSig,PEP,MassErrorPPM
CGSQTTTTHEAKQSSPTR,nt,C,35,true,"Mitochondrial intermediate peptidases - icp55 / WT",131a,25732537,,59.9600000,,-0.4547437,,,,
LGLALNCDLSLK,ox,C,135,true,"Redox kickstart of mitochondria",112,31871212,,,,-1.4488517,0.0012041,YES,,
SGIEAAEYACEMQR,ox,C,241,true,"Redox kickstart of mitochondria",112,31871212,,,,-1.7571908,0.0065379,YES,,
SGIEAAEYACEMQR,sno,C,241,true,"Site-specific nitrosomeproteomic id - gsnor1-3",90a,25699590,XCorr,3.8985300,,,,,1.1780000086503E-8,-4.6412166
SGIEAAEYACEMQR,sno,C,241,true,"Site-specific nitrosomeproteomic id - gsnor1-3",90b,25699590,XCorr,4.2600000,,,,,2.7809999210149E-6,-7.0100000
QALLYNQGKADQIVTETR,nt,Q,304,true,"HUNTER N-terminome: legumain, GluC and trypsin",119,31951383,"MaxQuant score",72.9370000,,,,,,
TVTMRKK,mox,M,333,true,"cat2 Methionine oxidation - 3h stress",62b,25693801,"MASCOT Score",38.0000000,,0.0552593,,NO,,
ASLPELPEAKR,ac,K,374,true,"Quantitative Acetylproteomics",101,29440448,,,,,,,,
