Peptide,PTM,ModifiedAA,ModifiedPosition,PeptideUniqueToGene,ExperimentDesc,ExpID,PubmedID,ScoreType,IdentScore,LocProb,Log2FChange,PQ-val,QuantSig,PEP,MassErrorPPM
QTSPCNWAGVK,acy,C,62,true,"Arabidopsis S-acylation atlas - Meristem",163a,35681017,,,,,,,,
QTSPCNWAGVK,acy,C,62,true,"Arabidopsis S-acylation atlas - Silique",163e,35681017,,,,,,,,
LPGVALSGDIPEGIFGNLTQLR,ng,N,95,true,"Conserved N-glycosylation",74,22633491,"MaxQuant Score",167.1500000,1.0000000,,,,0,-1.9700000
LPGVALSGDIPEGIFGNLTQLR,ng,N,95,true,"N-linked Glycan Micro-heterogeneity Arabidopsis",134,29237727,,,,,,,,
LPGVALSGDIPEGIFGNLTQLR,ng,N,95,true,"UDP-GlcNAc transporter glycopeptide analysis",135,30224661,,,,,,,2.6400541628391E-6,1.7000000
LNLASNSFTGEISSGFTNLTK,ng,N,167,true,"Conserved N-glycosylation",74,22633491,"MaxQuant Score",148.4400000,1.0000000,,,,1.0750000408766E-36,2.5930000
AVDISTIK,ph,S,305,true,"Tissue atlas Arabidopsis - ProteomicsDB",114,32188942,"MaxQuant score",116.5200000,0.9780990,,,,0.0031644199043512,
AVDISTIK,ph,T,306,true,"TOR Kinase and ABA Receptor",100,29290610,XCorr,2.7043960,0.9344000,,,,0.0038550000172108,
KLVFFGNATK,ub,K,353,false,"Ubiquitination Membrane Proteins",120,33585938,,,,,,,,
KLVFFGNATK,ub,K,353,false,"upl3 mutant / wildtype",168,35926874,"MaxQuant score",91.3130000,1.0000000,1.9313048,,,0.00067751097958535,0.1489200
VFDLEDLLRASAEVLGK,ph,S,373,false,"Arabidopsis root NAA phosphoproteome",18a,27643528,"MaxQuant Score",58.6930000,1.0000000,,,,2.325999957975E-5,-0.0650000
VFDLEDLLRASAEVLGK,ph,S,373,false,"Plasmamembrane phosphorylation",20,15308754,,,,,,,,
VFDLEDLLRASAEVLGK,ph,S,373,false,"Phosphorylation Early Elicitor Signaling",23,17317660,,,,,,,,
VFDLEDLLRASAEVLGK,ph,S,373,false,"Plasmembrane Ph Immune Responses",25,17651370,,,,,,,,
VFDLEDLLRASAEVLGK,ph,S,373,false,"Phosphoproteome ethylene-regulated time response",46,24043427,"MASCOT Score",101.2100000,,,,,,-11.3611000
VFDLEDLLRASAEVLGK,ph,S,373,false,"Tyrosine phosphorylation in Arabidopsis",59,18463617,"MASCOT Score",32.0000000,,,,,,-1.6376847
VFDLEDLLRASAEVLGK,ph,S,373,false,"Conserved plant phosphoproteome - Arabidopsis",61a,20466843,"MASCOT Score",61.0000000,1.0000000,,,,,
VFDLEDLLRASAEVLGK,ph,S,373,false,"SnRK2 protein kinase substrates",85,23776212,XCorr,2.7219119,1.0000000,,,,3.467350104952E-12,
VFDLEDLLRASAEVLGK,ph,S,373,false,"TOR Kinase and ABA Receptor",100,29290610,XCorr,3.3776073,1.0000000,,,,2.6949999210046E-7,
VFDLEDLLRASAEVLGK,ph,S,373,false,"Col-0 callus - FC Col-0 vs. Col-0 Xray",111a,31410901,,63.8100000,,0.5765731,0.0000000,NO,,0.7980760
VFDLEDLLRASAEVLGK,ph,S,373,false,"Col-0 X-ray callus - FC Col-0 vs. Col-0 Xray",111b,31410901,,63.8100000,,0.5765731,0.0000000,NO,,0.7980760
VFDLEDLLRASAEVLGK,ph,S,373,false,"atm callus - FC atm vs. atm Xray",111c,31410901,,63.8100000,,-0.6561934,0.0000000,NO,,0.7980760
VFDLEDLLRASAEVLGK,ph,S,373,false,"atm-3 X-ray callus - FC atm vs. atm Xray",111d,31410901,,63.8100000,,-0.6561934,0.0000000,NO,,0.7980760
VFDLEDLLRASAEVLGK,ph,S,373,false,"Tissue atlas Arabidopsis - ProteomicsDB",114,32188942,"MaxQuant score",305.8700000,1.0000000,,,,0,
VFDLEDLLRASAEVLGK,ph,S,373,false,"Touch-induced phosphorylation: 40s touch vs untouc",136,30291188,"MASCOT score",103.6800000,,-0.0035125,0.9853140,NO,,1.9146672
ASAEVLGK,ph,S,373,false,"Plasmamembrane phosphorylation",20,15308754,,,,,,,,
ASAEVLGK,ph,S,373,false,"Phosphorylation Early Elicitor Signaling",23,17317660,,,,,,,,
ASAEVLGK,ph,S,373,false,"Sucrose-induced phosphorylation",24,17586839,,,,,,,,
ASAEVLGK,ph,S,373,false,"Plasmembrane Ph Immune Responses",25,17651370,,,,,,,,
ASAEVLGK,ph,S,373,false,"Immuno-dot blot phosphorylation",31,19341826,"MASCOT Score",43.1300000,,,,,,10.7296000
ASAEVLGK,ph,S,373,false,"Phytohormone-responsive phosphoproteins",34,20374526,"MASCOT Score",50.0000000,,,,,,10.7581000
ASAEVLGK,ph,S,373,false,"Tyrosine phosphorylation in Arabidopsis",59,18463617,"MASCOT Score",47.0000000,,,,,,-0.4687165
ASAEVLGK,ph,S,373,false,"srk2dei ABA signaling phopshoproteomics",83,23572148,"MASCOT Score",44.0000000,,,,,,0.0004000
ASAEVLGK,ph,S,373,false,"LAXIC - mannitol vs control",84b,23660473,XCorr,2.0300000,1.0000000,-1.2490629,,NO,0.0014310600236058,
ASAEVLGK,ph,S,373,false,"SnRK2 protein kinase substrates",85,23776212,XCorr,3.0863461,1.0000000,,,,0.059298899024725,
ASAEVLGK,ph,S,373,false,"atm and atr DNA damage response",88,25561503,"MASCOT Score",58.0000000,1.0000000,,,,,1.7300000
ASAEVLGK,ph,S,373,false,"Phospho cell culture sucrose/TOR",109,30833711,,,1.0000000,,,,,
ASAEVLGK,ph,S,373,false,"Col-0 callus - FC Col-0 vs. Col-0 Xray",111a,31410901,,35.6000000,,0.2389819,0.0000000,NO,,-0.0113007
ASAEVLGK,ph,S,373,false,"Col-0 X-ray callus - FC Col-0 vs. Col-0 Xray",111b,31410901,,35.6000000,,0.2389819,0.0000000,NO,,-0.0113007
ASAEVLGK,ph,S,373,false,"atm callus - FC atm vs. atm Xray",111c,31410901,,31.6600000,,-1.6865110,0.0000000,NO,,-0.0674947
ASAEVLGK,ph,S,373,false,"atm-3 X-ray callus - FC atm vs. atm Xray",111d,31410901,,31.6600000,,-1.6865110,0.0000000,NO,,-0.0674947
ASAEVLGK,ph,S,373,false,"Tissue atlas Arabidopsis - ProteomicsDB",114,32188942,"MaxQuant score",114.9700000,1.0000000,,,,8.8670400145929E-5,
GAGRSPLNWDVR,ph,S,464,true,"Tissue atlas Arabidopsis - ProteomicsDB",114,32188942,"MaxQuant score",56.7680000,1.0000000,,,,0.0050100302323699,
SSNILLTKSHDAK,ac,K,506,true,"Quantitative Acetylproteomics",101,29440448,,,,,,,,
SSNILLTKSHDAK,ub,K,506,true,"Ubiquitination Membrane Proteins",120,33585938,,,,,,,,
KMENLRPYSGSDQVNEAD,ub,K,638,true,"upl3 mutant / wildtype",168,35926874,"MaxQuant score",99.0440000,1.0000000,0.0745054,,,8.5810398786634E-8,-0.1817400
KMENLRPYSGSDQVNEAD,ph,S,646,true,"Tissue atlas Arabidopsis - ProteomicsDB",114,32188942,"MaxQuant score",223.0700000,0.9652560,,,,0,
KMENLRPYSGSDQVNEAD,ph,S,648,true,"Chloroplast kinase substrates",60,19376835,"MASCOT Score",43.7900000,,,,,,-0.4969600
KMENLRPYSGSDQVNEAD,ph,S,648,true,"atm and atr DNA damage response",88,25561503,"MASCOT Score",22.0000000,1.0000000,,,,,-0.0300000
KMENLRPYSGSDQVNEAD,ph,S,648,true,"Tissue atlas Arabidopsis - ProteomicsDB",114,32188942,"MaxQuant score",207.1300000,0.9647170,,,,0,
MENLRPYSGSDQVNEAD,ph,S,648,true,"TOR Kinase and ABA Receptor",100,29290610,XCorr,3.3064232,0.8997000,,,,0.031530000269413,
