Peptide,PTM,ModifiedAA,ModifiedPosition,PeptideUniqueToGene,ExperimentDesc,ExpID,PubmedID,ScoreType,IdentScore,LocProb,Log2FChange,PQ-val,QuantSig,PEP,MassErrorPPM
VRKRRTDAPSEGGEGSGSRE,nt,V,2,true,"Arabidopsis translation initiation landscape - NT",167b,35069635,,,,,,,,
VRKRRTDAPS,nt,V,2,true,"N-term acetylation drought responses",5,26184543,,,,,,,,
TDAPSEGGEGSGSR,ph,S,11,true,"atm and atr DNA damage response",88,25561503,"MASCOT Score",50.0000000,0.9980000,,,,,-0.1500000
TDAPSEGGEGSGSR,ph,S,11,true,"Tissue atlas Arabidopsis - ProteomicsDB",114,32188942,"MaxQuant score",114.8800000,0.9999890,,,,5.5568700190634E-5,
RTDAPSEGGEGSGSR,ph,S,17,true,"Tissue atlas Arabidopsis - ProteomicsDB",114,32188942,"MaxQuant score",100.6800000,0.8783690,,,,4.152539986535E-6,
TDAPSEGGEGSGSR,ph,S,17,true,"atm and atr DNA damage response",88,25561503,"MASCOT Score",57.0000000,0.9930000,,,,,-0.2300000
KQSLGDGLESWR,ph,S,350,true,"Tissue atlas Arabidopsis - ProteomicsDB",114,32188942,"MaxQuant score",139.2100000,1.0000000,,,,8.8223996499437E-6,
ISTSLASVEAR,ph,S,557,true,"Tissue atlas Arabidopsis - ProteomicsDB",114,32188942,"MaxQuant score",93.7660000,0.8327810,,,,0.00019935499585699,
FYMEPETSDSGSMASGSMAR,ph,T,1000,true,"SnRK2 protein kinase substrates",85,23776212,XCorr,4.5855994,0.9590000,,,,0.00077959097689018,
FYMEPETSDSGSMASGSMAR,ph,T,1000,true,"atm and atr DNA damage response",88,25561503,"MASCOT Score",51.0000000,1.0000000,,,,,0.1100000
FYMEPETSDSGSMASGSMAR,ph,T,1000,true,"TOR Kinase and ABA Receptor",100,29290610,XCorr,4.1164470,0.9476000,,,,0.0014250000240281,
FYMEPETSDSGSMASGSMAR,ph,T,1000,true,"Lateral root-induction - NAA vs control",106,23328941,"MASCOT Score",80.0000000,,-0.0021353,0.9153505,NO,,
FYMEPETSDSGSMASGSMAR,ph,S,1001,true,"Phosphorylation nuclei-enriched fractions",28,19245862,,,,,,,,
FYMEPETSDSGSMASGSMAR,ph,S,1001,true,"Large-scale phosphorylation discovery",44,23111157,XCorr,5.9160000,,,,,,
FYMEPETSDSGSMASGSMAR,ph,S,1001,true,"PAMP-triggered phosphorylation",48,24601666,"MASCOT Score",85.7000000,,,,,,
FYMEPETSDSGSMASGSMAR,ph,S,1001,true,"Tyrosine phosphorylation in Arabidopsis",59,18463617,"MASCOT Score",83.0000000,,,,,,-1.3514621
FYMEPETSDSGSMASGSMAR,ph,S,1001,true,"Conserved plant phosphoproteome - Arabidopsis",61a,20466843,"MASCOT Score",89.0000000,1.0000000,,,,,
FYMEPETSDSGSMASGSMAR,ph,S,1001,true,"srk2dei ABA signaling phopshoproteomics",83,23572148,"MASCOT Score",98.0000000,,,,,,-0.0023000
FYMEPETSDSGSMASGSMAR,ph,S,1001,true,"LAXIC - ABA stress",84a,23660473,XCorr,5.7200000,0.9950000,,,,2.4200000336982E-10,
FYMEPETSDSGSMASGSMAR,ph,S,1001,true,"LAXIC - mannitol vs control",84b,23660473,XCorr,2.5500000,0.9890000,,,,1.1500000306414E-14,
FYMEPETSDSGSMASGSMAR,ph,S,1001,true,"SnRK2 protein kinase substrates",85,23776212,XCorr,3.9031317,0.9990000,,,,0.00047473699669354,
FYMEPETSDSGSMASGSMAR,ph,S,1001,true,"atm and atr DNA damage response",88,25561503,"MASCOT Score",72.0000000,1.0000000,,,,,-0.2800000
FYMEPETSDSGSMASGSMAR,ph,S,1001,true,"TOR Kinase and ABA Receptor",100,29290610,XCorr,5.7315392,0.9934000,,,,4.3619999279265E-10,
FYMEPETSDSGSMASGSMAR,ph,S,1001,true,"Lateral root-induction - NAA vs control",106,23328941,"MASCOT Score",81.0000000,,,,,,
FYMEPETSDSGSMASGSMAR,ph,S,1001,true,"Phospho cell culture sucrose/TOR",109,30833711,,,0.9636780,,,,,
FYMEPETSDSGSMASGSMAR,ph,S,1003,true,"srk2dei ABA signaling phopshoproteomics",83,23572148,"MASCOT Score",44.0000000,,,,,,-0.0010000
FYMEPETSDSGSMASGSMAR,ph,S,1003,true,"atm and atr DNA damage response",88,25561503,"MASCOT Score",24.0000000,0.9990000,,,,,2.2900000
FYMEPETSDSGSMASGSMAR,ph,S,1005,true,"srk2dei ABA signaling phopshoproteomics",83,23572148,"MASCOT Score",48.0000000,,,,,,-0.0021000
FYMEPETSDSGSMASGSMAR,ph,S,1005,true,"SnRK2 protein kinase substrates",85,23776212,XCorr,4.5855994,0.9570000,,,,0.00077959097689018,
FYMEPETSDSGSMASGSMAR,ph,S,1005,true,"atm and atr DNA damage response",88,25561503,"MASCOT Score",35.0000000,0.9940000,,,,,-0.0400000
FYMEPETSDSGSMASGSMAR,ph,S,1008,true,"atm and atr DNA damage response",88,25561503,"MASCOT Score",28.0000000,0.9940000,,,,,-0.7300000
