Peptide,PTM,ModifiedAA,ModifiedPosition,PeptideUniqueToGene,ExperimentDesc,ExpID,PubmedID,ScoreType,IdentScore,LocProb,Log2FChange,PQ-val,QuantSig,PEP,MassErrorPPM
SCFGWCGSEDFRN,nta,S,2,true,"HUNTER N-terminome: legumain, GluC and trypsin",119,31951383,"MaxQuant score",97.7340000,,,,,,
SCFGWCGSEDFR,nta,S,2,true,"HUNTER N-terminome: legumain, GluC and trypsin",119,31951383,"MaxQuant score",91.5490000,,,,,,
NATDTGPRPAHNPAGYNGGHYQR,ph,T,18,true,"Tissue atlas Arabidopsis - ProteomicsDB",114,32188942,"MaxQuant score",52.2490000,0.9046870,,,,0.00044812000123784,
DITDNYGSK,ph,S,70,false,"atm and atr DNA damage response",88,25561503,"MASCOT Score",56.0000000,1.0000000,,,,,0.4700000
DIKSSNVLLFDDDVAK,ph,S,201,false,"Tissue atlas Arabidopsis - ProteomicsDB",114,32188942,"MaxQuant score",76.1180000,0.9127280,,,,0.0007208000170067,
LHSTRVLGTFGYHAPEYAMTGTLSSK,ph,S,232,true,"Tissue atlas Arabidopsis - ProteomicsDB",114,32188942,"MaxQuant score",46.6950000,0.9395150,,,,0.0022484899964184,
LHSTRVLGTFGYHAPEYAMTGTLSSK,ph,T,233,true,"Tissue atlas Arabidopsis - ProteomicsDB",114,32188942,"MaxQuant score",46.6950000,0.9395150,,,,0.0022484899964184,
LSEDKVKQCVDAR,ub,K,300,false,"Ubiquitination Membrane Proteins",120,33585938,,,,,,,,
ALQPLLNPPRSAPQTPHRNPY,ph,S,353,false,"Large-scale phosphorylation discovery",44,23111157,XCorr,4.4800000,,,,,,
ALQPLLNPPRSAPQTPHRNPY,ph,S,353,false,"Brassinosteroid-Regulated Phosphorylation Dynamics",94,26187819,"MaxQuant Score",61.8210000,0.9990000,,,,0.021999999880791,0.1850000
ALQPLLNPPRSAPQTPHRNPY,ph,S,353,false,"TOR Kinase and ABA Receptor",100,29290610,XCorr,3.3061581,0.9997000,,,,0.004676999989897,
ALQPLLNPPRSAPQTPHR,ph,S,353,false,"TOR Kinase and ABA Receptor",100,29290610,XCorr,2.0790753,0.9994000,,,,0.00034030000097118,
SAPQTPHRNPY,ph,S,353,false,"atm and atr DNA damage response",88,25561503,"MASCOT Score",42.0000000,1.0000000,,,,,-1.7100000
SAPQTPHRNPY,ph,S,353,false,"Col-0 callus - FC Col-0 vs. Col-0 Xray",111a,31410901,,21.3500000,,-0.0155384,0.0000000,NO,,0.5758073
SAPQTPHRNPY,ph,S,353,false,"Col-0 X-ray callus - FC Col-0 vs. Col-0 Xray",111b,31410901,,21.3500000,,-0.0155384,0.0000000,NO,,0.5758073
SAPQTPHRNPY,ph,S,353,false,"atm callus - FC atm vs. atm Xray",111c,31410901,,21.3500000,,-0.3852663,0.0000000,NO,,0.5758073
SAPQTPHRNPY,ph,S,353,false,"atm-3 X-ray callus - FC atm vs. atm Xray",111d,31410901,,21.3500000,,-0.3852663,0.0000000,NO,,0.5758073
SAPQTPHRNPY,ph,S,353,false,"Tissue atlas Arabidopsis - ProteomicsDB",114,32188942,"MaxQuant score",181.7700000,1.0000000,,,,5.3313898434881E-12,
SAPQTPHR,ph,S,353,false,"atm and atr DNA damage response",88,25561503,"MASCOT Score",40.0000000,1.0000000,,,,,-0.3900000
ALQPLLNPPRSAPQTPHRNPY,ph,T,357,false,"Brassinosteroid-Regulated Phosphorylation Dynamics",94,26187819,"MaxQuant Score",61.8210000,0.9950000,,,,0.021999999880791,0.1850000
SAPQTPHRNPY,ph,T,357,false,"Large-scale phosphorylation discovery",44,23111157,XCorr,2.8220000,,,,,,
SAPQTPHRNPY,ph,T,357,false,"atm and atr DNA damage response",88,25561503,"MASCOT Score",42.0000000,1.0000000,,,,,-1.7100000
SAPQTPHRNPY,ph,T,357,false,"Col-0 callus - FC Col-0 vs. Col-0 Xray",111a,31410901,,21.3500000,,-0.0155384,0.0000000,NO,,0.5758073
SAPQTPHRNPY,ph,T,357,false,"Col-0 X-ray callus - FC Col-0 vs. Col-0 Xray",111b,31410901,,21.3500000,,-0.0155384,0.0000000,NO,,0.5758073
SAPQTPHRNPY,ph,T,357,false,"atm callus - FC atm vs. atm Xray",111c,31410901,,21.3500000,,-0.3852663,0.0000000,NO,,0.5758073
SAPQTPHRNPY,ph,T,357,false,"atm-3 X-ray callus - FC atm vs. atm Xray",111d,31410901,,21.3500000,,-0.3852663,0.0000000,NO,,0.5758073
SAPQTPHRNPY,ph,T,357,false,"Tissue atlas Arabidopsis - ProteomicsDB",114,32188942,"MaxQuant score",181.7700000,1.0000000,,,,5.3313898434881E-12,
SAPQTPHR,ph,T,357,false,"atm and atr DNA damage response",88,25561503,"MASCOT Score",40.0000000,1.0000000,,,,,-0.3900000
ALQPLLNPPRSAPQTPHRNPY,ph,Y,363,false,"TOR Kinase and ABA Receptor",100,29290610,XCorr,3.4917247,0.9055000,,,,0.0016129999421537,
