Peptide,PTM,ModifiedAA,ModifiedPosition,PeptideUniqueToGene,ExperimentDesc,ExpID,PubmedID,ScoreType,IdentScore,LocProb,Log2FChange,PQ-val,QuantSig,PEP,MassErrorPPM
PGITLGDTVPNLEVETTHDKF,nt,P,2,true,"Arg/N-end rule seed, prt6 vs. Wt",99,29168982,"MASCOT Score",51.6000000,,0.7353581,0.0743927,NO,0.00021159999596421,6.2137613
PGITLGDTVPNLEVETTH,nt,P,2,true,"Arg/N-end rule seed, prt6 vs. Wt",99,29168982,"MASCOT Score",69.1000000,,0.6199763,0.0182489,NO,0.0014189999783412,7.4011061
PGITLGDTVPNLE,nt,P,2,true,"Arg/N-end rule seed, prt6 vs. Wt",99,29168982,"MASCOT Score",67.4800000,,1.0829590,0.0206887,YES,6.3959996623453E-5,-0.2896588
PGITLGDTVPN,nt,P,2,true,"Arg/N-end rule seed, prt6 vs. Wt",99,29168982,"MASCOT Score",68.8900000,,0.7750681,0.0257055,NO,0.011970000341535,-1.4319212
LLGLSCDDVQSHK,sno,C,72,true,"hot5-4 / wildtype, FAT-switch S-nitrosoproteome",169,37277371,,,,1.3671591,0.0000378,YES,,
IATPVNWKPDQPVVISPAVSDEEAKK,ph,S,182,true,"Tissue atlas Arabidopsis - ProteomicsDB",114,32188942,"MaxQuant score",117.9000000,0.9936820,,,,1.1619400169856E-28,
IATPVNWKPDQPVVISPAVSDEEAKK,ph,S,186,true,"Tissue atlas Arabidopsis - ProteomicsDB",114,32188942,"MaxQuant score",113.7000000,0.9989140,,,,7.1735300416761E-28,
TADLPSKK,ph,S,205,true,"Tissue atlas Arabidopsis - ProteomicsDB",114,32188942,"MaxQuant score",78.1360000,1.0000000,,,,0.0076138200238347,
