Peptide,PTM,ModifiedAA,ModifiedPosition,PeptideUniqueToGene,ExperimentDesc,ExpID,PubmedID,ScoreType,IdentScore,LocProb,Log2FChange,PQ-val,QuantSig,PEP,MassErrorPPM
NLSNSPTDALR,ph,S,19,true,"TOR Kinase and ABA Receptor",100,29290610,XCorr,3.0331082,0.9819000,,,,0.0013610000023618,
NLSNSPTDALR,ph,S,19,true,"Tissue atlas Arabidopsis - ProteomicsDB",114,32188942,"MaxQuant score",101.3800000,0.9999890,,,,7.5444899266586E-5,
FSFSLSR,ph,S,31,true,"Tissue atlas Arabidopsis - ProteomicsDB",114,32188942,"MaxQuant score",85.8620000,0.9595960,,,,0.018505299463868,
FASSGSDENDVVIIGGGPGGYVAAIKASQLGLKTTCIEKR,nt,F,36,true,"Mitochondrial intermediate peptidases - icp55 / WT",131a,25732537,,90.6600000,,6.6438562,,,,
ASSGSDENDVVIIGGGPGGYVAAIKASQLGLKTTCIEKR,nt,A,37,true,"Mitochondrial intermediate peptidases - icp55 / WT",131a,25732537,,97.1900000,,-0.6924793,,,,
ASSGSDENDVVIIGGGPGGYVAAIKASQLGLKTTCIEKR,nt,A,37,true,"Mitochondrial intermediate peptidases - oct1-1 / WT",131b,25732537,,92.0200000,,-0.3276583,,,,
ASSGSDENDVVIIGGGPGGYVAAIKASQLGLKTTCIEKR,nt,A,37,true,"Mitochondrial intermediate peptidases - oct1-2 / WT",131c,25732537,,75.4500000,,-0.4501607,,,,
ASSGSDENDVVIIGGGPGGYVAAIKASQL,nt,A,37,true,"Arabidopsis translation initiation landscape - NT",167b,35069635,,,,,,,,
ASSGSDENDVVIIG,nt,A,37,true,"N-terminal ChaFRADIC",92,26010716,"MASCOT Score",90.0800000,,,,,3.589999963971E-10,
ASSGSDENDVVII,nt,A,37,true,"N-terminal ChaFRADIC",92,26010716,"MASCOT Score",51.1000000,,,,,3.950999882818E-8,
SSGSDENDVVIIG,nt,S,38,true,"N-terminal ChaFRADIC",92,26010716,"MASCOT Score",78.5600000,,,,,3.551000049562E-10,
SSGSDENDVVII,nt,S,38,true,"N-terminal ChaFRADIC",92,26010716,"MASCOT Score",90.7300000,,,,,1.4730000330587E-8,
SGSDENDVVIIG,nt,S,39,true,"N-terminal ChaFRADIC",92,26010716,"MASCOT Score",63.7700000,,,,,1.2809999816454E-6,
GSDENDVVIIG,nt,G,40,true,"N-terminal ChaFRADIC",92,26010716,"MASCOT Score",21.5200000,,,,,5.9239999245619E-5,
SDENDVVIIG,nt,S,41,true,"N-terminal ChaFRADIC",92,26010716,"MASCOT Score",50.7700000,,,,,3.2069998269435E-5,
TTCIEK,ox,C,71,false,"OxiTRAQ Arabidopsis - 5 mM H2O2 versus control",47,24376095,,,,-0.5203343,0.0064689,YES,,
TTCIEK,sno,C,71,false,"hot5-4 / wildtype, FAT-switch S-nitrosoproteome",169,37277371,,,,,,,,
GALGGTCLNVGCIPSK,ox,C,82,false,"OxiTRAQ Arabidopsis - 5 mM H2O2 versus control",47,24376095,,,,-0.2558979,0.0895624,NO,,
GALGGTCLNVGCIPSK,sno,C,82,false,"hot5-4 / wildtype, FAT-switch S-nitrosoproteome",169,37277371,,,,1.2770339,0.0021705,YES,,
GALGGTCLNVGCIPSK,ox,C,87,false,"OxiTRAQ Arabidopsis - 5 mM H2O2 versus control",47,24376095,,,,-0.2558979,0.0895624,NO,,
GALGGTCLNVGCIPSK,so,C,87,false,"Arabidopsis S-sulfenylation chemoproteomics",108,31578252,"pFind PSM Score",0.0001988,,0.7384000,,,,-0.9528541
DNAVKNLTR,ac,K,133,true,"Quantitative Acetylproteomics",101,29440448,,,,,,,,
GIEGLFKK,ac,K,144,true,"Quantitative Acetylproteomics",101,29440448,,,,,,,,
KNKVTYVK,ac,K,147,true,"Quantitative Acetylproteomics",101,29440448,,,,,,,,
GKHIIVATGSDVK,ac,K,178,false,"Quantitative Acetylproteomics",101,29440448,,,,,,,,
HIIVATGSDVK,ac,K,189,false,"Quantitative Acetylproteomics",101,29440448,,,,,,,,
SLPGITIDEK,ph,S,190,false,"atm and atr DNA damage response",88,25561503,"MASCOT Score",49.0000000,1.0000000,,,,,-0.6100000
SLPGITIDEKK,ac,K,199,false,"Quantitative Acetylproteomics",101,29440448,,,,,,,,
TPFTSGLDLEK,ph,T,318,false,"srk2dei ABA signaling phopshoproteomics",83,23572148,"MASCOT Score",36.0000000,,,,,,-0.0008000
TPFTSGLDLEK,ph,T,318,false,"atm and atr DNA damage response",88,25561503,"MASCOT Score",33.0000000,0.9310000,,,,,-1.1700000
TPFTSGLDLEK,ph,S,319,false,"Tyrosine phosphorylation in Arabidopsis",59,18463617,"MASCOT Score",31.0000000,,,,,,-2.1763181
TPFTSGLDLEK,ph,S,319,false,"srk2dei ABA signaling phopshoproteomics",83,23572148,"MASCOT Score",62.0000000,,,,,,-0.0006000
TPFTSGLDLEK,ph,S,319,false,"SnRK2 protein kinase substrates",85,23776212,XCorr,2.5946863,0.9990000,,,,0.00050097098574042,
TPFTSGLDLEK,ph,S,319,false,"atm and atr DNA damage response",88,25561503,"MASCOT Score",40.0000000,0.9990000,,,,,-1.0500000
TPFTSGLDLEK,ph,S,319,false,"TOR Kinase and ABA Receptor",100,29290610,XCorr,4.2797632,0.9927000,,,,3.8890000723768E-5,
TPFTSGLDLEK,ph,S,319,false,"Phospho cell culture sucrose/TOR",109,30833711,,,0.9922480,,,,,
TPFTSGLDLEK,ph,S,319,false,"Tissue atlas Arabidopsis - ProteomicsDB",114,32188942,"MaxQuant score",190.1000000,0.9978130,,,,3.2773400449525E-18,
AEEDGVACVEFIAGK,ox,C,372,false,"Redox kickstart of mitochondria",112,31871212,,,,-0.5688844,0.0021295,YES,,
AEEDGVACVEFIAGK,ox,C,372,false,"SPEAR - 10 mM H2O2 / mock",138a,34619326,,,,-1.0581740,0.0033875,YES,,
AEEDGVACVEFIAGK,sno,C,372,false,"Endogenous S-nitrosylation in Arabidopsis",64,22115780,"MASCOT Score",79.0000000,,,,,,
AEEDGVACVEFIAGK,sno,C,372,false,"Cold stress nitrosylation - 4°C vs 22°C",65,24388526,,,,,,,,
AEEDGVACVEFIAGK,so,C,372,false,"Arabidopsis S-sulfenylation chemoproteomics",108,31578252,"pFind PSM Score",0.2790100,,1.0869600,,,,-1.8733566
AEEDGVACVEFIAGK,so,C,372,false,"S-sulfenylation site detection using YAP1C",110,32714340,,,,,,,,
FIAGKHGHVDYDKVPGVVYTHPE,nt,F,375,true,"Arabidopsis translation initiation landscape - NT",167b,35069635,,,,,,,,
FPFMANSRAK,mox,M,423,false,"cat2 Methionine oxidation - 1h stress",62a,25693801,"MASCOT Score",55.0000000,,0.0532136,,NO,,
FPFMANSRAK,mox,M,423,false,"cat2 Methionine oxidation - 3h stress",62b,25693801,"MASCOT Score",41.0000000,,-0.1799681,,NO,,
