Peptide,PTM,ModifiedAA,ModifiedPosition,PeptideUniqueToGene,ExperimentDesc,ExpID,PubmedID,ScoreType,IdentScore,LocProb,Log2FChange,PQ-val,QuantSig,PEP,MassErrorPPM
NEEKNMCIRSAESANK,acy,C,305,true,"Arabidopsis S-acylation atlas - Leaf",163c,35681017,,,,,,,,
VSSPCKSPGGYSSTGSEFSLDNAQK,ph,S,375,true,"Tissue atlas Arabidopsis - ProteomicsDB",114,32188942,"MaxQuant score",142.0100000,0.9460690,,,,2.3820100865284E-36,
SPGGYSSTGSEFSLDNAQK,ph,S,379,true,"atm and atr DNA damage response",88,25561503,"MASCOT Score",37.0000000,0.9050000,,,,,-0.8000000
SPGGYSSTGSEFSLDNAQK,ph,S,379,true,"TOR Kinase and ABA Receptor",100,29290610,XCorr,5.3266864,1.0000000,,,,6.2279998935821E-9,
SPGGYSSTGSEFSLDNAQK,ph,S,379,true,"Lateral root-induction - NAA vs control",106,23328941,"MASCOT Score",45.0000000,,,,,,
SPGGYSSTGSEFSLDNAQK,ph,S,379,true,"Tissue atlas Arabidopsis - ProteomicsDB",114,32188942,"MaxQuant score",291.1700000,1.0000000,,,,0,
SPGGYSSTGSEFSLDNAQK,ph,S,384,true,"Lateral root-induction - NAA vs control",106,23328941,"MASCOT Score",49.0000000,,,,,,
VESVNSHVELMDDFLEMEK,ph,S,515,true,"Large-scale phosphorylation discovery",44,23111157,XCorr,5.4180000,,,,,,
VESVNSHVELMDDFLEMEK,ph,S,515,true,"srk2dei ABA signaling phopshoproteomics",83,23572148,"MASCOT Score",57.0000000,,,,,,0.0002000
VESVNSHVELMDDFLEMEK,ph,S,515,true,"TOR Kinase and ABA Receptor",100,29290610,XCorr,5.9337859,1.0000000,,,,4.1409998630115E-7,
VESVNSHVELMDDFLEMEK,ph,S,515,true,"Tissue atlas Arabidopsis - ProteomicsDB",114,32188942,"MaxQuant score",148.0900000,1.0000000,,,,1.799109974087E-18,
VESVNSHVELMDDFLEMEK,ph,S,518,true,"srk2dei ABA signaling phopshoproteomics",83,23572148,"MASCOT Score",57.0000000,,,,,,0.0002000
VESVNSHVELMDDFLEMEK,ph,S,518,true,"TOR Kinase and ABA Receptor",100,29290610,XCorr,5.9337859,1.0000000,,,,4.1409998630115E-7,
VESVNSHVELMDDFLEMEK,ph,S,518,true,"Tissue atlas Arabidopsis - ProteomicsDB",114,32188942,"MaxQuant score",161.6800000,1.0000000,,,,5.9621299423037E-23,
SEMVILDAHTDLEDSDR,ph,T,565,true,"Tissue atlas Arabidopsis - ProteomicsDB",114,32188942,"MaxQuant score",153.3600000,0.9995130,,,,7.9157698191362E-13,
SEMVILDAHTDLEDSDRGSPAVMK,ph,S,574,true,"Tissue atlas Arabidopsis - ProteomicsDB",114,32188942,"MaxQuant score",105.5500000,0.7994360,,,,5.2706499411446E-17,
GLASSEVETLSPDCIDK,ph,S,742,true,"Tissue atlas Arabidopsis - ProteomicsDB",114,32188942,"MaxQuant score",283.2200000,0.9999810,,,,0,
VSGYESDSKLQEIEELR,ph,S,789,true,"Phosphorylation Early Elicitor Signaling",23,17317660,,,,,,,,
VSGYESDSKLQEIEELR,ph,S,789,true,"LAXIC - ABA stress",84a,23660473,XCorr,3.6400000,0.9740000,,,,0.03462940081954,
VSGYESDSKLQEIEELR,ph,S,789,true,"SnRK2 protein kinase substrates",85,23776212,XCorr,4.1485085,1.0000000,,,,0.0029209901113063,
VSGYESDSKLQEIEELR,ph,S,789,true,"Col-0 callus - FC Col-0 vs. Col-0 Xray",111a,31410901,,101.8000000,,0.6068701,0.0000000,NO,,0.6091465
VSGYESDSKLQEIEELR,ph,S,789,true,"Col-0 X-ray callus - FC Col-0 vs. Col-0 Xray",111b,31410901,,101.8000000,,0.6068701,0.0000000,NO,,0.6091465
VSGYESDSKLQEIEELR,ph,S,789,true,"atm callus - FC atm vs. atm Xray",111c,31410901,,101.8000000,,0.8975741,0.0000000,NO,,0.6091465
VSGYESDSKLQEIEELR,ph,S,789,true,"atm-3 X-ray callus - FC atm vs. atm Xray",111d,31410901,,101.8000000,,0.8975741,0.0000000,NO,,0.6091465
VSGYESDSKLQEIEELR,ph,S,789,true,"Tissue atlas Arabidopsis - ProteomicsDB",114,32188942,"MaxQuant score",250.9800000,0.9999610,,,,0,
VSGYESDSKLQEIEELR,ph,S,789,true,"Touch-induced phosphorylation: 40s touch vs untouc",136,30291188,"MASCOT score",129.3700000,,0.0441349,0.7247473,NO,,-5.8155797
VSGYESDSK,ph,S,789,true,"STN8 phosphoproteome",38,21768351,"MASCOT Score",40.9900000,,,,,,-0.3025280
VSGYESDSK,ph,S,789,true,"atm and atr DNA damage response",88,25561503,"MASCOT Score",46.0000000,1.0000000,,,,,-1.2000000
VSGYESDSKLQEIEELR,ph,S,791,true,"LAXIC - mannitol vs control",84b,23660473,XCorr,3.8000000,0.8640000,,,,0.0020731999538839,
SFRPQPEQMR,ph,S,950,true,"Tissue atlas Arabidopsis - ProteomicsDB",114,32188942,"MaxQuant score",84.4100000,1.0000000,,,,0.00019079800404143,
SFRPQPEQMRSPQTR,ph,S,960,true,"Tissue atlas Arabidopsis - ProteomicsDB",114,32188942,"MaxQuant score",45.4380000,0.9959010,,,,0.0050190300680697,
NESYSEEEELGTTTTSVPK,ph,S,967,true,"Lateral root-induction - NAA vs control",106,23328941,"MASCOT Score",43.0000000,,,,,,
NESYSEEEELGTTTTSVPK,ph,S,967,true,"Tissue atlas Arabidopsis - ProteomicsDB",114,32188942,"MaxQuant score",174.8100000,0.9993810,,,,1.2264799757225E-28,
NESYSEEEELGTTTTSVPK,ph,S,969,true,"Tissue atlas Arabidopsis - ProteomicsDB",114,32188942,"MaxQuant score",398.9900000,1.0000000,,,,0,
NESYSEEEELGTTTTSVPK,ph,S,969,true,"Touch-induced phosphorylation: 40s touch vs untouc",136,30291188,"MASCOT score",148.4900000,,-0.0166288,0.8891233,NO,,0.7647370
NYAVVDEGDSVNEVPR,ph,S,993,true,"Tissue atlas Arabidopsis - ProteomicsDB",114,32188942,"MaxQuant score",168.4200000,1.0000000,,,,4.1156999517854E-19,
FMESPKCPSDSETSDTTTSPSR,ph,S,1003,true,"Tissue atlas Arabidopsis - ProteomicsDB",114,32188942,"MaxQuant score",160.9100000,0.9989660,,,,1.7868800300281E-38,
CPSDSETSDTTTSPSR,ox,C,1006,true,"OxiTRAQ Arabidopsis - 5 mM H2O2 versus control",47,24376095,,,,0.5284440,0.0277574,YES,,
CPSDSETSDTTTSPSR,ph,S,1008,true,"SnRK2 protein kinase substrates",85,23776212,XCorr,3.6824896,1.0000000,,,,5.5528298625873E-10,
CPSDSETSDTTTSPSR,ph,S,1008,true,"atm and atr DNA damage response",88,25561503,"MASCOT Score",67.0000000,1.0000000,,,,,-0.1000000
CPSDSETSDTTTSPSR,ph,S,1008,true,"Tissue atlas Arabidopsis - ProteomicsDB",114,32188942,"MaxQuant score",89.6040000,0.9951990,,,,1.2613600119948E-7,
CPSDSETSDTTTSPSR,ph,T,1015,true,"atm and atr DNA damage response",88,25561503,"MASCOT Score",24.0000000,0.8890000,,,,,0.5600000
CPSDSETSDTTTSPSR,ph,S,1018,true,"atm and atr DNA damage response",88,25561503,"MASCOT Score",28.0000000,0.9060000,,,,,1.1000000
CPSDSETSDTTTSPSR,ph,S,1018,true,"Tissue atlas Arabidopsis - ProteomicsDB",114,32188942,"MaxQuant score",234.3000000,0.8994320,,,,0,
CPSDSETSDTTTSPSR,ph,S,1020,true,"atm and atr DNA damage response",88,25561503,"MASCOT Score",31.0000000,0.9890000,,,,,0.9500000
SGSSTNATPEK,ph,S,1031,true,"atm and atr DNA damage response",88,25561503,"MASCOT Score",57.0000000,0.8820000,,,,,-1.6400000
SGSSTNATPEK,ph,T,1036,true,"atm and atr DNA damage response",88,25561503,"MASCOT Score",37.0000000,0.9920000,,,,,0.5100000
